Gentoo Websites Logo
Go to: Gentoo Home Documentation Forums Lists Bugs Planet Store Wiki Get Gentoo!
Bug 666796 - www-client/firefox-62.0.2: undefined symbol: js::SetDOMProxyInformation(void const*, js::DOMProxyShadowsResult (*)(JSContext*, JS::Handle<JSObject*>, JS::Handle<jsid>))
Summary: www-client/firefox-62.0.2: undefined symbol: js::SetDOMProxyInformation(void ...
Status: UNCONFIRMED
Alias: None
Product: Gentoo Linux
Classification: Unclassified
Component: Current packages (show other bugs)
Hardware: All Linux
: Normal normal (vote)
Assignee: Mozilla Gentoo Team
URL:
Whiteboard:
Keywords:
Depends on:
Blocks:
 
Reported: 2018-09-23 08:42 UTC by Vasilis Lourdas
Modified: 2019-03-31 19:28 UTC (History)
4 users (show)

See Also:
Package list:
Runtime testing required: ---


Attachments
build log (build.log.tar.gz,130.35 KB, application/gzip)
2018-09-23 15:47 UTC, Mark Jacobson
Details

Note You need to log in before you can comment on or make changes to this bug.
Description Vasilis Lourdas 2018-09-23 08:42:17 UTC
15:37.40 rm -f libxul.so
15:37.40 /usr/lib/llvm/6/bin/x86_64-pc-linux-gnu-clang++ -Qunused-arguments -flto -U_FORTIFY_SOURCE -D_FORTIFY_SOURCE=2 -Qunused-arguments -Wall -Wempty-body -Wignored-qualifiers -Woverloaded-virtual -Wpointer-arith -Wsign-compare -Wtype-limits -Wunreachable-code -Wunreachable-code-return -Wwrite-strings -Wno-invalid-offsetof -Wclass-varargs -Wloop-analysis -Wc++1z-compat -Wcomma -Wimplicit-fallthrough -Wstring-conversion -Wno-inline-new-delete -Wno-error=deprecated-declarations -Wno-error=array-bounds -Wformat -Wformat-security -Wno-gnu-zero-variadic-macro-arguments -Wno-unknown-warning-option -Wno-return-type-c-linkage -fno-sized-deallocation -pipe -flto -U_FORTIFY_SOURCE -D_FORTIFY_SOURCE=2 -fno-exceptions -fno-strict-aliasing -fno-rtti -ffunction-sections -fdata-sections -fno-exceptions -fno-math-errno -pthread -pipe -O2 -fomit-frame-pointer  -fPIC -shared -Wl,-h,libxul.so -o libxul.so /var/tmp/portage/www-client/firefox-62.0.2/work/firefox-62.0.2/ff/toolkit/library/libxul_so.list  -lpthread -Wl,-O1 -Wl,--hash-style=gnu -Wl,--as-needed -Wl,-rpath=/usr/lib64/firefox,--enable-new-dtags -fuse-ld=lld -flto -Wl,-z,noexecstack -Wl,-z,text -Wl,-z,relro -Wl,-rpath-link,/var/tmp/portage/www-client/firefox-62.0.2/work/firefox-62.0.2/ff/dist/bin -Wl,-rpath-link,/usr/lib   -fcolor-diagnostics ../../js/src/build/libjs_static.a x86_64-unknown-linux-gnu/release/libgkrust.a ../../security/sandbox/linux/libmozsandbox.so ../../config/external/lgpllibs/liblgpllibs.so ../../config/external/sqlite/libmozsqlite3.so ../../widget/gtk/mozgtk/stub/libmozgtk_stub.so -Wl,--version-script,symverscript  -ldl  -lrt -lm -lX11 -lX11-xcb -lxcb -lXcomposite -lXcursor -lXdamage -lXext -lXfixes -lXi -lXrender -L/usr/lib64/../lib64 -lffi -lplds4 -lplc4 -lnspr4 -lpthread -ldl -lz -lssl3 -lsmime3 -lnss3 -lnssutil3 -lfreetype -lfontconfig -L/usr/lib64 -lpng -lpixman-1 -ldbus-glib-1 -ldbus-1 -lgobject-2.0 -lglib-2.0 -lpangocairo-1.0 -lpango-1.0 -latk-1.0 -lcairo-gobject -lcairo -lgdk_pixbuf-2.0 -lgio-2.0 -lstartup-notification-1 -lxcb-shm -lpangoft2-1.0 -lXt -lgthread-2.0
32:18.23 ld.lld: error: undefined symbol: js::SetDOMProxyInformation(void const*, js::DOMProxyShadowsResult (*)(JSContext*, JS::Handle<JSObject*>, JS::Handle<jsid>))
32:18.23 >>> referenced by ld-temp.o
32:18.23 >>>               lto.tmp:(_GLOBAL__sub_I_Unified_cpp_dom_bindings0.cpp)
32:18.23 ld.lld: error: undefined symbol: void js::UnsafeTraceManuallyBarrieredEdge<JSObject*>(JSTracer*, JSObject**, char const*)
32:18.23 >>> referenced by ld-temp.o
32:18.23 >>>               lto.tmp:(JS::StructGCPolicy<JS::GCVector<JSObject*, 0ul, js::SystemAllocPolicy> >::trace(JSTracer*, JS::GCVector<JSObject*, 0ul, js::SystemAllocPolicy>*, char const*))
32:18.23 ld.lld: error: undefined symbol: JS_SetContextPrivate(JSContext*, void*)
32:18.23 >>> referenced by ld-temp.o
32:18.23 >>>               lto.tmp:(mozilla::CycleCollectedJSContext::~CycleCollectedJSContext())
32:18.23 ld.lld: error: undefined symbol: JS_DestroyContext(JSContext*)
32:18.23 >>> referenced by ld-temp.o
32:18.23 >>>               lto.tmp:(mozilla::CycleCollectedJSContext::~CycleCollectedJSContext())
32:18.23 ld.lld: error: undefined symbol: JS::IsIdleGCTaskNeeded(JSRuntime*)
32:18.23 >>> referenced by ld-temp.o
32:18.23 >>>               lto.tmp:(mozilla::CycleCollectedJSContext::AfterProcessTask(unsigned int))
32:18.23 ld.lld: error: undefined symbol: JS::RunIdleTimeGCTask(JSRuntime*)
32:18.23 >>> referenced by ld-temp.o
32:18.23 >>>               lto.tmp:(mozilla::CycleCollectedJSContext::IsIdleGCTaskNeeded()::IdleTimeGCTaskRunnable::Run())
32:18.23 ld.lld: error: undefined symbol: JS::SetGetIncumbentGlobalCallback(JSContext*, JSObject* (*)(JSContext*))
32:18.23 >>> referenced by ld-temp.o
32:18.23 >>>               lto.tmp:(mozilla::CycleCollectedJSContext::InitializeCommon())
32:18.23 ld.lld: error: undefined symbol: JS::SetEnqueuePromiseJobCallback(JSContext*, bool (*)(JSContext*, JS::Handle<JSObject*>, JS::Handle<JSObject*>, JS::Handle<JSObject*>, void*), void*)
32:18.23 >>> referenced by ld-temp.o
32:18.23 >>>               lto.tmp:(mozilla::CycleCollectedJSContext::InitializeCommon())
32:18.23 ld.lld: error: undefined symbol: JS::SetPromiseRejectionTrackerCallback(JSContext*, void (*)(JSContext*, JS::Handle<JSObject*>, JS::PromiseRejectionHandlingState, void*), void*)
32:18.23 >>> referenced by ld-temp.o
32:18.23 >>>               lto.tmp:(mozilla::CycleCollectedJSContext::InitializeCommon())
32:18.23 ld.lld: error: undefined symbol: JS::AddPersistentRoot(JS::RootingContext*, JS::RootKind, JS::PersistentRooted<void*>*)
32:18.23 >>> referenced by ld-temp.o
32:18.23 >>>               lto.tmp:(mozilla::CycleCollectedJSContext::InitializeCommon())
32:18.23 ld.lld: error: undefined symbol: JS::AddPersistentRoot(JS::RootingContext*, JS::RootKind, JS::PersistentRooted<void*>*)
32:18.23 >>> referenced by ld-temp.o
32:18.23 >>>               lto.tmp:(mozilla::CycleCollectedJSContext::InitializeCommon())
32:18.23 ld.lld: error: undefined symbol: JS_SetContextPrivate(JSContext*, void*)
32:18.23 >>> referenced by ld-temp.o
32:18.23 >>>               lto.tmp:(mozilla::CycleCollectedJSContext::InitializeCommon())
32:18.23 ld.lld: error: undefined symbol: JS::GetScriptedCallerGlobal(JSContext*)
32:18.23 >>> referenced by ld-temp.o
32:18.23 >>>               lto.tmp:(mozilla::CycleCollectedJSContext::GetIncumbentGlobalCallback(JSContext*))
32:18.23 ld.lld: error: undefined symbol: JS::HeapObjectPostBarrier(JSObject**, JSObject*, JSObject*)
32:18.23 >>> referenced by ld-temp.o
32:18.23 >>>               lto.tmp:(mozilla::CycleCollectedJSContext::EnqueuePromiseJobCallback(JSContext*, JS::Handle<JSObject*>, JS::Handle<JSObject*>, JS::Handle<JSObject*>, void*))
32:18.23 ld.lld: error: undefined symbol: JS::HeapObjectPostBarrier(JSObject**, JSObject*, JSObject*)
32:18.23 >>> referenced by ld-temp.o
32:18.23 >>>               lto.tmp:(mozilla::CycleCollectedJSContext::EnqueuePromiseJobCallback(JSContext*, JS::Handle<JSObject*>, JS::Handle<JSObject*>, JS::Handle<JSObject*>, void*))
32:18.23 ld.lld: error: undefined symbol: JS::HeapObjectPostBarrier(JSObject**, JSObject*, JSObject*)
32:18.23 >>> referenced by ld-temp.o
32:18.23 >>>               lto.tmp:(mozilla::CycleCollectedJSContext::EnqueuePromiseJobCallback(JSContext*, JS::Handle<JSObject*>, JS::Handle<JSObject*>, JS::Handle<JSObject*>, void*))
32:18.23 ld.lld: error: undefined symbol: JS::HeapObjectPostBarrier(JSObject**, JSObject*, JSObject*)
32:18.23 >>> referenced by ld-temp.o
32:18.23 >>>               lto.tmp:(mozilla::CycleCollectedJSContext::EnqueuePromiseJobCallback(JSContext*, JS::Handle<JSObject*>, JS::Handle<JSObject*>, JS::Handle<JSObject*>, void*))
32:18.23 ld.lld: error: undefined symbol: JS::HeapObjectPostBarrier(JSObject**, JSObject*, JSObject*)
32:18.23 >>> referenced by ld-temp.o
32:18.24 >>>               lto.tmp:(mozilla::dom::CallbackObject::~CallbackObject())
32:18.24 ld.lld: error: undefined symbol: JS::HeapObjectPostBarrier(JSObject**, JSObject*, JSObject*)
32:18.24 >>> referenced by ld-temp.o
32:18.24 >>>               lto.tmp:(mozilla::dom::CallbackObject::~CallbackObject())
32:18.24 ld.lld: error: undefined symbol: JS::HeapObjectPostBarrier(JSObject**, JSObject*, JSObject*)
32:18.24 >>> referenced by ld-temp.o
32:18.24 >>>               lto.tmp:(mozilla::dom::PromiseJobCallback::~PromiseJobCallback())
32:18.24 ld.lld: error: too many errors emitted, stopping now (use -error-limit=0 to see all errors)
32:18.38 clang-6.0: error: linker command failed with exit code 1 (use -v to see invocation)
32:18.38 gmake[4]: *** [/var/tmp/portage/www-client/firefox-62.0.2/work/firefox-62.0.2/config/rules.mk:681: libxul.so] Error 1
32:18.38 gmake[4]: Leaving directory '/var/tmp/portage/www-client/firefox-62.0.2/work/firefox-62.0.2/ff/toolkit/library'
32:18.38 gmake[3]: *** [/var/tmp/portage/www-client/firefox-62.0.2/work/firefox-62.0.2/config/recurse.mk:74: toolkit/library/target] Error 2
32:18.38 gmake[3]: Leaving directory '/var/tmp/portage/www-client/firefox-62.0.2/work/firefox-62.0.2/ff'
32:18.38 gmake[2]: *** [/var/tmp/portage/www-client/firefox-62.0.2/work/firefox-62.0.2/config/recurse.mk:34: compile] Error 2
32:18.38 gmake[2]: Leaving directory '/var/tmp/portage/www-client/firefox-62.0.2/work/firefox-62.0.2/ff'
32:18.38 gmake[1]: *** [/var/tmp/portage/www-client/firefox-62.0.2/work/firefox-62.0.2/config/rules.mk:418: default] Error 2
32:18.38 gmake[1]: Leaving directory '/var/tmp/portage/www-client/firefox-62.0.2/work/firefox-62.0.2/ff'
32:18.38 gmake: *** [client.mk:150: build] Error 2
32:18.40 125 compiler warnings present.


emerge -vp firefox

These are the packages that would be merged, in order:

Calculating dependencies      ... done!                            
[ebuild     U ~] www-client/firefox-62.0.2::gentoo [62.0-r1::gentoo] USE="clang%* dbus gmp-autoupdate hwaccel lto%* pulseaudio screenshot startup-notification -bindist -custom-cflags -custom-optimization -debug -eme-free -geckodriver% -hardened -jack (-neon) (-selinux) -system-harfbuzz -system-icu -system-jpeg -system-libevent -system-libvpx -system-sqlite -test -wifi" L10N="el -ach -af -an -ar -as -ast -az -bg -bn-BD -bn-IN -br -bs -ca -cak -cs -cy -da -de -dsb -en-GB -en-ZA -eo -es-AR -es-CL -es-ES -es-MX -et -eu -fa -ff -fi -fr -fy -ga -gd -gl -gn -gu -he -hi -hr -hsb -hu -hy -id -is -it -ja -ka -kab -kk -km -kn -ko -lij -lt -lv -mai -mk -ml -mr -ms -nb -nl -nn -or -pa -pl -pt-BR -pt-PT -rm -ro -ru -si -sk -sl -son -sq -sr -sv -ta -te -th -tr -uk -uz -vi -xh -zh-CN -zh-TW" 0 KiB
Comment 1 Vasilis Lourdas 2018-09-23 08:42:27 UTC
emerge --info
Portage 2.3.49 (python 3.5.5-final-0, default/linux/amd64/17.0/desktop/plasma/systemd, gcc-7.3.0, glibc-2.26-r7, 4.18.9-gentoo x86_64)
=================================================================
System uname: Linux-4.18.9-gentoo-x86_64-Intel-R-_Core-TM-_i5-8600_CPU_@_3.10GHz-with-gentoo-2.4.1
KiB Mem:    16342024 total,   6936924 free
KiB Swap:    8388600 total,   8388600 free
Timestamp of repository gentoo: Sun, 23 Sep 2018 06:30:01 +0000
Head commit of repository gentoo: 467e51993c34f0d1794baea5ecca4a298db3439d
sh bash 4.4_p12
ld GNU ld (Gentoo 2.30 p2) 2.30.0
app-shells/bash:          4.4_p12::gentoo
dev-java/java-config:     2.2.0-r4::gentoo
dev-lang/perl:            5.24.3-r1::gentoo
dev-lang/python:          2.7.15::gentoo, 3.4.8::gentoo, 3.5.5::gentoo, 3.6.5::gentoo
dev-util/cmake:           3.9.6::gentoo
dev-util/pkgconfig:       0.29.2::gentoo
sys-apps/baselayout:      2.4.1-r2::gentoo
sys-apps/sandbox:         2.13::gentoo
sys-devel/autoconf:       2.13::gentoo, 2.69-r4::gentoo
sys-devel/automake:       1.11.6-r3::gentoo, 1.15.1-r2::gentoo
sys-devel/binutils:       2.30-r2::gentoo
sys-devel/gcc:            6.4.0-r1::gentoo, 7.3.0-r3::gentoo
sys-devel/gcc-config:     1.8-r1::gentoo
sys-devel/libtool:        2.4.6-r3::gentoo
sys-devel/make:           4.2.1-r4::gentoo
sys-kernel/linux-headers: 4.13::gentoo (virtual/os-headers)
sys-libs/glibc:           2.26-r7::gentoo
Repositories:

gentoo
    location: /usr/portage
    sync-type: rsync
    sync-uri: rsync://rsync.gentoo.org/gentoo-portage
    priority: -1000
    sync-rsync-verify-jobs: 1
    sync-rsync-verify-metamanifest: yes
    sync-rsync-verify-max-age: 24
    sync-rsync-extra-opts: 

Local-overlay-Vasilis
    location: /usr/local/portage
    masters: gentoo
    priority: 0

ACCEPT_KEYWORDS="amd64"
ACCEPT_LICENSE="* -@EULA skype-eula Google-TOS AdobeFlash-11.x Oracle-BCLA-JavaSE skype-4.0.0.7-copyright TeamViewer PUEL google-chrome OPERA-2014 RAR intel-ucode-20180807"
CBUILD="x86_64-pc-linux-gnu"
CFLAGS="-O2 -pipe -mmmx -msse -msse2 -msse3 -mssse3 -mcx16 -msahf -mmovbe -maes -mpclmul -mpopcnt -mabm -mfma -mbmi -msgx -mbmi2 -mavx -mavx2 -msse4.2 -msse4.1 -mlzcnt -mrtm -mhle -mrdrnd -mf16c -mfsgsbase -mrdseed -mprfchw -madx -mfxsr -mxsave -mxsaveopt -mclflushopt -mxsavec -mxsaves --param l1-cache-size=32 --param l1-cache-line-size=64 --param l2-cache-size=9216"
CHOST="x86_64-pc-linux-gnu"
CONFIG_PROTECT="/etc /usr/lib64/libreoffice/program/sofficerc /usr/share/config /usr/share/gnupg/qualified.txt"
CONFIG_PROTECT_MASK="/etc/ca-certificates.conf /etc/dconf /etc/env.d /etc/fonts/fonts.conf /etc/gconf /etc/gentoo-release /etc/php/apache2-php5.6/ext-active/ /etc/php/apache2-php7.0/ext-active/ /etc/php/apache2-php7.1/ext-active/ /etc/php/apache2-php7.2/ext-active/ /etc/php/cgi-php5.6/ext-active/ /etc/php/cgi-php7.0/ext-active/ /etc/php/cgi-php7.1/ext-active/ /etc/php/cgi-php7.2/ext-active/ /etc/php/cli-php5.6/ext-active/ /etc/php/cli-php7.0/ext-active/ /etc/php/cli-php7.1/ext-active/ /etc/php/cli-php7.2/ext-active/ /etc/revdep-rebuild /etc/sandbox.d /etc/terminfo /etc/texmf/language.dat.d /etc/texmf/language.def.d /etc/texmf/updmap.d /etc/texmf/web2c"
CXXFLAGS="-O2 -pipe -mmmx -msse -msse2 -msse3 -mssse3 -mcx16 -msahf -mmovbe -maes -mpclmul -mpopcnt -mabm -mfma -mbmi -msgx -mbmi2 -mavx -mavx2 -msse4.2 -msse4.1 -mlzcnt -mrtm -mhle -mrdrnd -mf16c -mfsgsbase -mrdseed -mprfchw -madx -mfxsr -mxsave -mxsaveopt -mclflushopt -mxsavec -mxsaves --param l1-cache-size=32 --param l1-cache-line-size=64 --param l2-cache-size=9216"
DISTDIR="/usr/portage/distfiles"
ENV_UNSET="DBUS_SESSION_BUS_ADDRESS DISPLAY PERL5LIB PERL5OPT PERLPREFIX PERL_CORE PERL_MB_OPT PERL_MM_OPT XAUTHORITY XDG_CACHE_HOME XDG_CONFIG_HOME XDG_DATA_HOME XDG_RUNTIME_DIR"
FCFLAGS="-O2 -pipe"
FEATURES="assume-digests binpkg-logs candy cgroup config-protect-if-modified distlocks ebuild-locks fixlafiles merge-sync multilib-strict news parallel-fetch protect-owned sandbox sfperms strict unknown-features-warn unmerge-logs unmerge-orphans userfetch userpriv usersandbox usersync xattr"
FFLAGS="-O2 -pipe"
GENTOO_MIRRORS="http://ftp.heanet.ie/pub/gentoo/ http://ftp.vectranet.pl/gentoo/ http://ftp.snt.utwente.nl/pub/os/linux/gentoo http://mirror.mdfnet.se/gentoo"
LDFLAGS="-Wl,-O1 -Wl,--hash-style=gnu -Wl,--as-needed"
LINGUAS="en en_GB en_US el"
MAKEOPTS="-j6"
PKGDIR="/usr/portage/packages"
PORTAGE_CONFIGROOT="/"
PORTAGE_RSYNC_OPTS="--recursive --links --safe-links --perms --times --omit-dir-times --compress --force --whole-file --delete --stats --human-readable --timeout=180 --exclude=/distfiles --exclude=/local --exclude=/packages --exclude=/.git"
PORTAGE_TMPDIR="/var/tmp"
USE="256-color X a52 aac acl acpi activities additions admin aio alsa amd64 apache2 apng archive asf bash-completion bcmath berkdb branding bzip2 bzlib cairo calendar caps cdr cgmanager cgroups charconv chm clang cleartype_hinting cli contrast corefonts crypt cryptsetup css ctype cups cupsddk curl cxx dba dbus dcc_video declarative device-mapper dia dmi dri dri3 dts dvd dvdr dvdread ebook effects efi emboss encode epub exif expat extended extensions extras faac faad fam fastcgi fat fbcon ffmpeg fftw filecaps filter firefox3 flac fontconfig foomaticdb fpm freerdp ftp g3dvl gallium gd gdbm gif gimp gimpprint git glamor glib glx gmp gnome-keyring gnomedb gocr gphoto2 gpm graphviz gs gstreamer gtk hddtemp hotpixels howl http2 hwaccel iconv icu id3tag imagemagick imap imlib innodb inotify intl ipv6 iso14755 jabber java java6 javascript jemalloc jpeg jpeg2k json kde kipi kwallet lame lcdfilter lcms lensfun libkms libnotify libtirpc libwww lm_sensors lzma mad madwifi maildir mailwrapper maps matroska mdadm melt mime minizip mmap mmx mmxext modules motif mozbranding mozdevelop mozilla mozsvg mp3 mp4 mpeg mplayer mpm-worker multilib multiuser mysql mysqli mysqlnd ncurses newspr nlpsolver nls no-old-linux nodrm nomalloccheck nptl nsplugin ntfs ntfsprogs nvidia objc offensive ofx ogg oldpim opcache opengl openmp openssl optimization oqgraph osmesa pam pango pcmcia pcntl pcre pdf pdfimport pdo pear pgo phonon php pie plasma plotutils pmu png policykit posix postgres ppds pulseaudio python qml qt4 qt5 quicktime rar raw rdesktop rdoc readline redeyes reports romio rpc sasl scanner script sdl seccomp server sha512 sharedext sharedmem simplexml smp sna sndfile soap sockets sound speex spell sphinx spreadsheet sqlite sqlite3 srt sse sse2 sse3 sse4_1 ssl ssse3 startup-notification subtitles subversion svg symlink sysfs syslog systemd sysv-utils sysvipc tcltk tcpd templates tetex theora thin-splines threads tidy tiff tokenizer tordns truetype tty-helpers udev udisks unicode upower urandom usb userlocales uuid v4l vda vdpau vhost-net video vmware-tools vmware_guest_linux vmware_guest_windows vncviewer vorbis vpx wddx webm widgets windeco wv wxgtk1 wxwidgets x264 x265 xattr xcb xcomposite xetex xft xml xmlreader xmlrpc xmlwriter xmp xorg xpdf-headers xpm xprint xscreensaver xsl xslt xv xvfb xvid xvnc zip zlib" ABI_X86="64" ALSA_CARDS="hda-intel" APACHE2_MODULES="alias auth_basic authn_core authn_dbm authn_file authz_core authz_dbm authz_groupfile authz_host authz_owner authz_user autoindex cgid deflate dir env expires filter headers http2 log_config logio mime mime_magic negotiation proxy proxy_fcgi rewrite setenvif socache_shmcb unixd userdir" APACHE2_MPMS="event" CALLIGRA_FEATURES="karbon plan sheets stage words" COLLECTD_PLUGINS="df interface irq load memory rrdtool swap syslog" CPU_FLAGS_X86="aes avx avx2 f16c fma3 mmx mmxext pclmul popcnt sse sse2 sse3 sse4_1 sse4_2 ssse3" ELIBC="glibc" ENLIGHTENMENT_MODULES="appmenu backlight battery clock comp conf conf-applications conf-dialogs conf-display conf-edgebindings conf-interaction conf-intl conf-keybindings conf-menus conf-paths conf-performance conf-randr conf-shelves conf-theme conf-window-manipulation conf-window-remembers cpufreq dropshadow everything fileman fileman-opinfo gadman ibar ibox illume2 mixer msgbus notification pager quickaccess start syscon systray tasks temperature tiling winlist wizard xkbswitch" GPSD_PROTOCOLS="ashtech aivdm earthmate evermore fv18 garmin garmintxt gpsclock isync itrax mtk3301 nmea ntrip navcom oceanserver oldstyle oncore rtcm104v2 rtcm104v3 sirf skytraq superstar2 timing tsip tripmate tnt ublox ubx" GRUB_PLATFORMS="efi-64" INPUT_DEVICES="libinput keyboard mouse" KERNEL="linux" L10N="en el" LCD_DEVICES="bayrad cfontz cfontz633 glk hd44780 lb216 lcdm001 mtxorb ncurses text" LIBREOFFICE_EXTENSIONS="presenter-minimizer nlpsolver" OFFICE_IMPLEMENTATION="libreoffice" PHP_TARGETS="php5-6 php7-0 php7-1 php7-2" POSTGRES_TARGETS="postgres9_6" PYTHON_SINGLE_TARGET="python2_7" PYTHON_TARGETS="python2_7 python3_4 python3_5 python3_6" RUBY_TARGETS="ruby22 ruby23" SANE_BACKENDS="snapscan" USERLAND="GNU" VIDEO_CARDS="nvidia" XTABLES_ADDONS="quota2 psd pknock lscan length2 ipv4options ipset ipp2p iface geoip fuzzy condition tee tarpit sysrq steal rawnat logmark ipmark dhcpmac delude chaos account"
Unset:  CC, CPPFLAGS, CTARGET, CXX, EMERGE_DEFAULT_OPTS, INSTALL_MASK, LANG, LC_ALL, PORTAGE_BINHOST, PORTAGE_BUNZIP2_COMMAND, PORTAGE_COMPRESS, PORTAGE_COMPRESS_FLAGS, PORTAGE_RSYNC_EXTRA_OPTS
Comment 2 Mark Jacobson 2018-09-23 15:47:58 UTC
Created attachment 547628 [details]
build log
Comment 3 Mark Jacobson 2018-09-23 15:50:36 UTC
(In reply to Mark Jacobson from comment #2)
> Created attachment 547628 [details]
> build log

Apologies, I messed up my comment before attaching a build log. I'm getting a very similar problem when I attempted to update, here's the relevant bit of the build log:


^[7^[8^[[1G^[[K^[[34m 9:21.83^[(B^[[m ^[[0m^[[0m^[[1m^[[32m    Finished^[[0m release [optimized] target(s) in 8m 47s^[(B^[[m
^[7^[8^[[1G^[[K^[[34m 9:21.88^[(B^[[m gmake[4]: Leaving directory '/var/tmp/portage/www-client/firefox-62.0.2/work/firefox-62.0.2/ff/toolkit/library/rust'^[(B^[[m
^[7^[8^[[1G^[[K^[[34m 9:21.88^[(B^[[m gmake[3]: Leaving directory '/var/tmp/portage/www-client/firefox-62.0.2/work/firefox-62.0.2/ff'^[(B^[[m
^[7^[8^[[1G^[[K^[[34m 9:21.88^[(B^[[m gmake[2]: *** [/var/tmp/portage/www-client/firefox-62.0.2/work/firefox-62.0.2/config/recurse.mk:34: compile] Error 2^[(B^[[m
^[7^[8^[[1G^[[K^[[34m 9:21.88^[(B^[[m gmake[2]: Leaving directory '/var/tmp/portage/www-client/firefox-62.0.2/work/firefox-62.0.2/ff'^[(B^[[m
^[7^[8^[[1G^[[K^[[34m 9:21.88^[(B^[[m gmake[1]: *** [/var/tmp/portage/www-client/firefox-62.0.2/work/firefox-62.0.2/config/rules.mk:418: default] Error 2^[(B^[[m
^[7^[8^[[1G^[[K^[[34m 9:21.88^[(B^[[m gmake[1]: Leaving directory '/var/tmp/portage/www-client/firefox-62.0.2/work/firefox-62.0.2/ff'^[(B^[[m
^[7^[8^[[1G^[[K^[[34m 9:21.88^[(B^[[m gmake: *** [client.mk:150: build] Error 2^[(B^[[m
^[7^[8^[[1G^[[K^[[34m 9:21.91^[(B^[[m 0 compiler warnings present.^[(B^[[m
^[7^[8^[[1G^[[K ^[[31;01m*^[[0m ERROR: www-client/firefox-62.0.2::gentoo failed (compile phase):
 ^[[31;01m*^[[0m   (no error message)
 ^[[31;01m*^[[0m
 ^[[31;01m*^[[0m Call stack:
 ^[[31;01m*^[[0m     ebuild.sh, line 124:  Called src_compile
 ^[[31;01m*^[[0m   environment, line 5001:  Called die
 ^[[31;01m*^[[0m The specific snippet of code:
 ^[[31;01m*^[[0m       MOZ_MAKE_FLAGS="${MAKEOPTS}" SHELL="${SHELL:-${EPREFIX}/bin/bash}" MOZ_NOSPAM=1 ./mach build --verbose || die
 ^[[31;01m*^[[0m
 ^[[31;01m*^[[0m If you need support, post the output of `emerge --info '=www-client/firefox-62.0.2::gentoo'`,
 ^[[31;01m*^[[0m the complete build log and the output of `emerge -pqv '=www-client/firefox-62.0.2::gentoo'`.
 ^[[31;01m*^[[0m The complete build log is located at '/var/tmp/portage/www-client/firefox-62.0.2/temp/build.log'.
 ^[[31;01m*^[[0m The ebuild environment file is located at '/var/tmp/portage/www-client/firefox-62.0.2/temp/environment'.
 ^[[31;01m*^[[0m Working directory: '/var/tmp/portage/www-client/firefox-62.0.2/work/firefox-62.0.2'
 ^[[31;01m*^[[0m S: '/var/tmp/portage/www-client/firefox-62.0.2/work/firefox-62.0.2'

Also here's my emerge --info 

Portage 2.3.49 (python 3.6.5-final-0, default/linux/amd64/17.0/desktop/plasma/systemd, gcc-7.3.0, glibc-2.26-r7, 4.18.9-gentoo x86_64)
=================================================================
                         System Settings
=================================================================
System uname: Linux-4.18.9-gentoo-x86_64-AMD_Ryzen_7_1800X_Eight-Core_Processor-with-gentoo-2.4.1
KiB Mem:    16432824 total,   5659148 free
KiB Swap:          0 total,         0 free
Timestamp of repository gentoo: Sun, 23 Sep 2018 15:00:01 +0000
Head commit of repository gentoo: 93dfe5ba210abb6c363c711847ad1e9c3963f4fc
sh bash 4.4_p12
ld GNU ld (Gentoo 2.30 p2) 2.30.0
app-shells/bash:          4.4_p12::gentoo
dev-lang/perl:            5.24.3-r1::gentoo
dev-lang/python:          2.7.15::gentoo, 3.6.5::gentoo
dev-util/cmake:           3.9.6::gentoo
dev-util/pkgconfig:       0.29.2::gentoo
sys-apps/baselayout:      2.4.1-r2::gentoo
sys-apps/sandbox:         2.13::gentoo
sys-devel/autoconf:       2.13::gentoo, 2.69-r4::gentoo
sys-devel/automake:       1.15.1-r2::gentoo
sys-devel/binutils:       2.30-r2::gentoo
sys-devel/gcc:            7.3.0-r3::gentoo
sys-devel/gcc-config:     1.8-r1::gentoo
sys-devel/libtool:        2.4.6-r3::gentoo
sys-devel/make:           4.2.1-r4::gentoo
sys-kernel/linux-headers: 4.13::gentoo (virtual/os-headers)
sys-libs/glibc:           2.26-r7::gentoo
Repositories:

gentoo
    location: /usr/portage
    sync-type: rsync
    sync-uri: rsync://rsync.gentoo.org/gentoo-portage
    priority: -1000
    sync-rsync-verify-jobs: 1
    sync-rsync-verify-metamanifest: yes
    sync-rsync-extra-opts: 
    sync-rsync-verify-max-age: 24

Installed sets: @steam
ACCEPT_KEYWORDS="amd64"
ACCEPT_LICENSE="* -@EULA"
CBUILD="x86_64-pc-linux-gnu"
CFLAGS="-march=znver1 -O2 -pipe"
CHOST="x86_64-pc-linux-gnu"
CONFIG_PROTECT="/etc /usr/share/config /usr/share/gnupg/qualified.txt"
CONFIG_PROTECT_MASK="/etc/ca-certificates.conf /etc/dconf /etc/env.d /etc/fonts/fonts.conf /etc/gconf /etc/gentoo-release /etc/sandbox.d /etc/terminfo"
CXXFLAGS="-O2 -pipe"
DISTDIR="/usr/portage/distfiles"
ENV_UNSET="DBUS_SESSION_BUS_ADDRESS DISPLAY PERL5LIB PERL5OPT PERLPREFIX PERL_CORE PERL_MB_OPT PERL_MM_OPT XAUTHORITY XDG_CACHE_HOME XDG_CONFIG_HOME XDG_DATA_HOME XDG_RUNTIME_DIR"
FCFLAGS="-O2 -pipe"
FEATURES="assume-digests binpkg-logs config-protect-if-modified distlocks ebuild-locks fixlafiles merge-sync multilib-strict news parallel-fetch preserve-libs protect-owned sandbox sfperms strict unknown-features-warn unmerge-logs unmerge-orphans userfetch userpriv usersandbox usersync xattr"
FFLAGS="-O2 -pipe"
GENTOO_MIRRORS="http://gentoo.cs.utah.edu/"
LANG="en_US.utf8"
LDFLAGS="-Wl,-O1 -Wl,--as-needed"
MAKEOPTS="-j16"
PKGDIR="/usr/portage/packages"
PORTAGE_CONFIGROOT="/"
PORTAGE_RSYNC_OPTS="--recursive --links --safe-links --perms --times --omit-dir-times --compress --force --whole-file --delete --stats --human-readable --timeout=180 --exclude=/distfiles --exclude=/local --exclude=/packages --exclude=/.git"
PORTAGE_TMPDIR="/var/tmp"
USE="X a52 aac acl acpi activities alsa amd64 berkdb bluetooth branding bzip2 cairo cdda cdr cli crypt cups cxx dbus declarative dri dts dvd dvdr emboss encode exif fam flac fortran gdbm gif glamor gpm gtk iconv ipv6 jpeg kde kipi kwallet lcms ldap libnotify libtirpc mad mng modules mp3 mp4 mpeg multilib ncurses nls nptl ogg opengl openmp pam pango pcre pdf phonon plasma png policykit ppds pulseaudio qml qt qt5 readline sdl seccomp semantic-desktop spell ssl startup-notification svg systemd tcpd tiff truetype udev udisks unicode upower usb vorbis vulkan widgets wxwidgets x264 xattr xcb xcomposite xml xv xvid zlib" ABI_X86="32 64" ALSA_CARDS="ali5451 als4000 atiixp atiixp-modem bt87x ca0106 cmipci emu10k1x ens1370 ens1371 es1938 es1968 fm801 hda-intel intel8x0 intel8x0m maestro3 trident usb-audio via82xx via82xx-modem ymfpci" APACHE2_MODULES="authn_core authz_core socache_shmcb unixd actions alias auth_basic authn_alias authn_anon authn_dbm authn_default authn_file authz_dbm authz_default authz_groupfile authz_host authz_owner authz_user autoindex cache cgi cgid dav dav_fs dav_lock deflate dir disk_cache env expires ext_filter file_cache filter headers include info log_config logio mem_cache mime mime_magic negotiation rewrite setenvif speling status unique_id userdir usertrack vhost_alias" CALLIGRA_FEATURES="karbon plan sheets stage words" COLLECTD_PLUGINS="df interface irq load memory rrdtool swap syslog" CPU_FLAGS_X86="mmx mmxext sse sse2" ELIBC="glibc" GPSD_PROTOCOLS="ashtech aivdm earthmate evermore fv18 garmin garmintxt gpsclock isync itrax mtk3301 nmea ntrip navcom oceanserver oldstyle oncore rtcm104v2 rtcm104v3 sirf skytraq superstar2 timing tsip tripmate tnt ublox ubx" INPUT_DEVICES="libinput keyboard mouse" KERNEL="linux" LCD_DEVICES="bayrad cfontz cfontz633 glk hd44780 lb216 lcdm001 mtxorb ncurses text" LIBREOFFICE_EXTENSIONS="presenter-console presenter-minimizer" OFFICE_IMPLEMENTATION="libreoffice" PHP_TARGETS="php5-6 php7-0" POSTGRES_TARGETS="postgres9_5 postgres10" PYTHON_SINGLE_TARGET="python3_6" PYTHON_TARGETS="python2_7 python3_6" RUBY_TARGETS="ruby23" USERLAND="GNU" VIDEO_CARDS="amdgpu radeonsi" XTABLES_ADDONS="quota2 psd pknock lscan length2 ipv4options ipset ipp2p iface geoip fuzzy condition tee tarpit sysrq steal rawnat logmark ipmark dhcpmac delude chaos account"
Unset:  CC, CPPFLAGS, CTARGET, CXX, EMERGE_DEFAULT_OPTS, INSTALL_MASK, LC_ALL, LINGUAS, PORTAGE_BINHOST, PORTAGE_BUNZIP2_COMMAND, PORTAGE_COMPRESS, PORTAGE_COMPRESS_FLAGS, PORTAGE_RSYNC_EXTRA_OPTS