Gentoo Websites Logo
Go to: Gentoo Home Documentation Forums Lists Bugs Planet Store Wiki Get Gentoo!
Bug 656346 - dev-perl/Template-Plugin-Latex-3.120.0 : [TEST] FAILED 4: - template text 1 process FAILED: [% USE Latex;\n FILTER latex(fi...
Summary: dev-perl/Template-Plugin-Latex-3.120.0 : [TEST] FAILED 4: - template text 1 p...
Status: CONFIRMED
Alias: None
Product: Gentoo Linux
Classification: Unclassified
Component: Current packages (show other bugs)
Hardware: All Linux
: Normal normal (vote)
Assignee: Gentoo Perl team
URL:
Whiteboard:
Keywords: TESTFAILURE
Depends on:
Blocks: perl-testfailure
  Show dependency tree
 
Reported: 2018-05-23 16:30 UTC by Toralf Förster
Modified: 2019-10-11 22:15 UTC (History)
1 user (show)

See Also:
Package list:
Runtime testing required: ---


Attachments
emerge-info.txt (emerge-info.txt,17.96 KB, text/plain)
2018-05-23 16:30 UTC, Toralf Förster
Details
dev-perl:Template-Plugin-Latex-3.120.0:20180523-064939.log (dev-perl:Template-Plugin-Latex-3.120.0:20180523-064939.log,5.76 KB, text/plain)
2018-05-23 16:30 UTC, Toralf Förster
Details
emerge-history.txt (emerge-history.txt,317.99 KB, text/plain)
2018-05-23 16:30 UTC, Toralf Förster
Details
environment (environment,95.46 KB, text/plain)
2018-05-23 16:30 UTC, Toralf Förster
Details
etc.portage.tbz2 (etc.portage.tbz2,24.46 KB, application/x-bzip)
2018-05-23 16:30 UTC, Toralf Förster
Details
temp.tbz2 (temp.tbz2,24.10 KB, application/x-bzip)
2018-05-23 16:30 UTC, Toralf Förster
Details
tests.tbz2 (tests.tbz2,23.49 KB, application/x-bzip)
2018-05-23 16:30 UTC, Toralf Förster
Details

Note You need to log in before you can comment on or make changes to this bug.
Description Toralf Förster gentoo-dev 2018-05-23 16:30:26 UTC
t/10-output.t ......... 1/9 Template process failed: latex error - xelatex exited with errors:
failed to open /var/tmp/portage/dev-perl/Template-Plugin-Latex-3.120.0/temp/latexdrv23529_0/latexdoc.log for input
FAILED 4:  - template text 1 process FAILED: [% USE Latex;\n   FILTER latex(fi...
FAILED 5:  - (obviously did not match expected)

t/10-output.t ......... 6/9 

  -------------------------------------------------------------------

  This is an unstable amd64 chroot image at a tinderbox (==build bot)
  name: 17.0-hardened_test_20180512-194415

  -------------------------------------------------------------------

gcc-config -l:
 [1] x86_64-pc-linux-gnu-7.3.0 *

Available Python interpreters, in order of preference:
  [1]   python3.5
  [2]   python3.6 (fallback)
  [3]   python2.7 (fallback)
  [4]   pypy3 (fallback)
  [5]   pypy (fallback)

java-config:
The following VMs are available for generation-2:


emerge -qpv dev-perl/Template-Plugin-Latex
[ebuild  N    ] dev-perl/Template-Plugin-Latex-3.120.0  USE="{test}"
Comment 1 Toralf Förster gentoo-dev 2018-05-23 16:30:29 UTC
Created attachment 532722 [details]
emerge-info.txt
Comment 2 Toralf Förster gentoo-dev 2018-05-23 16:30:32 UTC
Created attachment 532724 [details]
dev-perl:Template-Plugin-Latex-3.120.0:20180523-064939.log
Comment 3 Toralf Förster gentoo-dev 2018-05-23 16:30:35 UTC
Created attachment 532726 [details]
emerge-history.txt
Comment 4 Toralf Förster gentoo-dev 2018-05-23 16:30:38 UTC
Created attachment 532728 [details]
environment
Comment 5 Toralf Förster gentoo-dev 2018-05-23 16:30:41 UTC
Created attachment 532730 [details]
etc.portage.tbz2
Comment 6 Toralf Förster gentoo-dev 2018-05-23 16:30:44 UTC
Created attachment 532732 [details]
temp.tbz2
Comment 7 Toralf Förster gentoo-dev 2018-05-23 16:30:47 UTC
Created attachment 532734 [details]
tests.tbz2
Comment 8 Kent Fredric (IRC: kent\n) gentoo-dev 2018-08-10 05:11:09 UTC
Test Summary Report
-------------------
t/10-output.t       (Wstat: 0 Tests: 9 Failed: 2)
  Failed tests:  4-5
t/12-template.t     (Wstat: 0 Tests: 11 Failed: 8)
  Failed tests:  4-11
Files=9, Tests=79,  7 wallclock secs ( 0.06 usr  0.02 sys +  4.47 cusr  0.52 csys =  5.07 CPU)
Result: FAIL

---

t/10-output.t .........
1..9
ok 1 - running test_expect()
ok 2 - template processor is engaged
ok 3 - input read and split into 3 tests
Template process failed: latex error - xelatex exited with errors:
failed to open /var/tmp/portage/dev-perl/Template-Plugin-Latex-3.120.0/temp/latexdrv499825_0/latexdoc.log for input
not ok 4 - template text 1 process FAILED: [% USE Latex;\n   FILTER latex(fi...
not ok 5 - (obviously did not match expected)
FAILED 4:  - template text 1 process FAILED: [% USE Latex;\n   FILTER latex(fi...
FAILED 5:  - (obviously did not match expected)
ok 6 - template text 2 processed OK: [% USE Latex;\n   FILTER latex(ou...
ok 7 - template text 2 matched expected
ok 8 - template text 3 processed OK: [% USE Latex;\n   FILTER latex(fi...
ok 9 - template text 3 matched expected
Failed 2/9 subtests

---

t/12-template.t .......
1..11
ok 1 - running test_expect()
ok 2 - template processor is engaged
ok 3 - input read and split into 4 tests
Template process failed: latex error - xelatex exited with errors:
failed to open /var/tmp/portage/dev-perl/Template-Plugin-Latex-3.120.0/temp/latexdrv499831_0/latexdoc.log for input
not ok 4 - template text 1 process FAILED: [% FILTER latex(file.pdf) -%]\n\d...
not ok 5 - (obviously did not match expected)
FAILED 4:  - template text 1 process FAILED: [% FILTER latex(file.pdf) -%]\n\d...
FAILED 5:  - (obviously did not match expected)
Template process failed: latex error - xelatex exited with errors:
failed to open /var/tmp/portage/dev-perl/Template-Plugin-Latex-3.120.0/temp/latexdrv499831_0/latexdoc.log for input
not ok 6 - template text 2 process FAILED: [% FILTER latex(output=file.ps) ...
not ok 7 - (obviously did not match expected)
FAILED 6:  - template text 2 process FAILED: [% FILTER latex(output=file.ps) ...
FAILED 7:  - (obviously did not match expected)
Template process failed: latex error - xelatex exited with errors:
failed to open /var/tmp/portage/dev-perl/Template-Plugin-Latex-3.120.0/temp/latexdrv499831_0/latexdoc.log for input
not ok 8 - template text 3 process FAILED: [% FILTER latex(file.dvi) -%]\n\d...
not ok 9 - (obviously did not match expected)
FAILED 8:  - template text 3 process FAILED: [% FILTER latex(file.dvi) -%]\n\d...
FAILED 9:  - (obviously did not match expected)
Template process failed: latex error - xelatex exited with errors:
failed to open /var/tmp/portage/dev-perl/Template-Plugin-Latex-3.120.0/temp/latexdrv499831_0/latexdoc.log for input
not ok 10 - template text 4 process FAILED: [% FILTER latex(file.blank) -%]\n...
not ok 11 - (obviously did not match expected)
FAILED 10:  - template text 4 process FAILED: [% FILTER latex(file.blank) -%]\n...
FAILED 11:  - (obviously did not match expected)
Failed 8/11 subtests