Gentoo Websites Logo
Go to: Gentoo Home Documentation Forums Lists Bugs Planet Store Wiki Get Gentoo!
Bug 654196 - =dev-python/testtools-2.3.0 fails tests with pypy-6.0.0 and pypy3-6.0.0
Summary: =dev-python/testtools-2.3.0 fails tests with pypy-6.0.0 and pypy3-6.0.0
Alias: None
Product: Gentoo Linux
Classification: Unclassified
Component: Current packages (show other bugs)
Hardware: All Linux
: Normal normal (vote)
Assignee: Python Gentoo Team
Depends on:
Reported: 2018-04-27 12:50 UTC by Paolo Pedroni
Modified: 2018-07-13 20:27 UTC (History)
2 users (show)

See Also:
Package list:
Runtime testing required: ---

testtools-2.3.0:20180427-124226.log.gz (testtools-2.3.0:20180427-124226.log.gz,6.31 KB, application/gzip)
2018-04-27 12:50 UTC, Paolo Pedroni

Note You need to log in before you can comment on or make changes to this bug.
Description Paolo Pedroni 2018-04-27 12:50:19 UTC
Created attachment 528700 [details]

It used to work with pypy-5.10.0 and pypy3-5.10.1

>>> Test phase: dev-python/testtools-2.3.0
 * pypy: running distutils-r1_run_phase python_test
Tests running...
FAIL: testtools.tests.test_testresult.TestNonAsciiResults.test_syntax_error
Traceback (most recent call last):
  File "testtools/tests/", line 2688, in test_syntax_error
    ), textoutput)
  File "testtools/", line 417, in assertIn
    self.assertThat(haystack, Contains(needle), message)
  File "testtools/", line 498, in assertThat
    raise mismatch_error
testtools.matchers._impl.MismatchError: '  File "<string>", line 1\n    f(a, b c)\n          ^\nSyntaxError: ' not in u'Tests running...\n======================================================================\nERROR: test_syntax_error.Test.runTest\n----------------------------------------------------------------------\nTraceback (most recent call last):\n  File "/var/tmp/portage/dev-python/testtools-2.3.0/temp/TestNonAsciiResultsCx7U2y/", line 6, in runTest\n    exec (\'f(a, b c)\')\n  File "<string>", line 1\n    f(a, b c)\n           ^\nSyntaxError: invalid syntax (expected \')\')\n\nRan 1 test in 0.001s\nFAILED (failures=1)\n'
FAIL: testtools.tests.test_testresult.TestNonAsciiResultsWithUnittest.test_syntax_error
Traceback (most recent call last):
  File "testtools/tests/", line 2688, in test_syntax_error
    ), textoutput)
  File "testtools/", line 417, in assertIn
    self.assertThat(haystack, Contains(needle), message)
  File "testtools/", line 498, in assertThat
    raise mismatch_error
testtools.matchers._impl.MismatchError: '  File "<string>", line 1\n    f(a, b c)\n          ^\nSyntaxError: ' not in 'E\n======================================================================\nERROR: runTest (test_syntax_error.Test)\ntest_syntax_error.Test.runTest\n----------------------------------------------------------------------\n_StringException: Traceback (most recent call last):\n  File "/var/tmp/portage/dev-python/testtools-2.3.0/temp/TestNonAsciiResultsWithUnittestYIaDDv/", line 6, in runTest\n    exec (\'f(a, b c)\')\n  File "<string>", line 1\n    f(a, b c)\n           ^\nSyntaxError: invalid syntax (expected \')\')\n\n\n----------------------------------------------------------------------\nRan 1 test in 0.001s\n\nFAILED (errors=1)\n'

Ran 2625 tests in 1.813s
FAILED (failures=2)

With pypy3 I also get the following warning:
/usr/lib64/pypy3/lib-python/3/ RuntimeWarning: '' found in sys.modules after import of package 'testtools', but prior to execution of ''; this may result in unpredictable behaviour

Tests succeed with python2.7 and python3.6

# emerge --info =dev-python/testtools-2.3.0
emerge --info =dev-python/testtools-2.3.0
Portage 2.3.24 (python 3.6.5-final-0, default/linux/amd64/17.1/desktop/plasma/systemd, gcc-7.3.0, glibc-2.25-r11, 4.16.1-gentoo x86_64)
                         System Settings
System uname: Linux-4.16.1-gentoo-x86_64-Intel-R-_Core-TM-_i7-2600_CPU_@_3.40GHz-with-gentoo-2.4.1
KiB Mem:    15858236 total,   4253052 free
KiB Swap:    8171516 total,   8171516 free
Timestamp of repository gentoo: Fri, 27 Apr 2018 07:15:01 +0000
Head commit of repository gentoo: 471e96431ec6a3503a87cae2aa1459b48001d818
sh dash
ld GNU gold (Gentoo 2.29.1 p3 2.29.1) 1.14
distcc 3.2rc1 x86_64-pc-linux-gnu [enabled]
ccache version 3.3.4 [disabled]
app-shells/bash:          4.4_p12::gentoo
dev-java/java-config:     2.2.0-r4::gentoo
dev-lang/perl:            5.26.2::gentoo
dev-lang/python:          2.7.14-r1::gentoo, 3.6.5::gentoo
dev-util/ccache:          3.3.4-r1::gentoo
dev-util/cmake:           3.9.6::gentoo
dev-util/pkgconfig:       0.29.2::gentoo
sys-apps/baselayout:      2.4.1-r2::gentoo
sys-apps/sandbox:         2.13::gentoo
sys-devel/autoconf:       2.13::gentoo, 2.69-r4::gentoo
sys-devel/automake:       1.15.1-r2::gentoo
sys-devel/binutils:       2.29.1-r1::gentoo
sys-devel/gcc:            7.3.0-r1::gentoo
sys-devel/gcc-config:     1.9.1::gentoo
sys-devel/libtool:        2.4.6-r3::gentoo
sys-devel/make:           4.2.1::gentoo
sys-kernel/linux-headers: 4.13::gentoo (virtual/os-headers)
sys-libs/glibc:           2.25-r11::gentoo

    location: /usr/portage
    sync-type: rsync
    sync-uri: rsync://
    priority: -1000
    sync-rsync-verify-metamanifest: no

    location: /usr/local/portage
    masters: gentoo
    priority: 0

CFLAGS="-O2 -pipe -march=sandybridge -msahf --param l1-cache-size=32 --param l1-cache-line-size=64 --param l2-cache-size=8192 -flto=8"
CONFIG_PROTECT="/etc /usr/lib64/libreoffice/program/sofficerc /usr/share/config /usr/share/gnupg/qualified.txt"
CONFIG_PROTECT_MASK="/etc/ca-certificates.conf /etc/dconf /etc/env.d /etc/fonts/fonts.conf /etc/gconf /etc/gentoo-release /etc/revdep-rebuild /etc/sandbox.d /etc/terminfo"
CXXFLAGS="-O2 -pipe -march=sandybridge -msahf --param l1-cache-size=32 --param l1-cache-line-size=64 --param l2-cache-size=8192 -flto=8"
EMERGE_DEFAULT_OPTS="--keep-going y --with-bdeps y"
FCFLAGS="-O2 -pipe"
FEATURES="assume-digests binpkg-logs cgroup compress-build-logs config-protect-if-modified distcc distlocks ebuild-locks ipc-sandbox merge-sync multilib-strict news parallel-fetch preserve-libs protect-owned sandbox sfperms split-elog split-log strict test unknown-features-warn unmerge-logs unmerge-orphans userfetch userpriv usersandbox usersync xattr"
FFLAGS="-O2 -pipe"
LDFLAGS="-Wl,-O1 -Wl,--as-needed -Wl,--hash-style=gnu -Wl,--sort-common -flto=8"
LINGUAS="it it_IT"
MAKEOPTS="-j13 -l8"
PORTAGE_RSYNC_OPTS="--recursive --links --safe-links --perms --times --omit-dir-times --compress --force --whole-file --delete --stats --human-readable --timeout=180 --exclude=/distfiles --exclude=/local --exclude=/packages --exclude=/.git"
USE="X a52 aac aalib acl acpi activities adns alsa amd64 ao audiofile bash-completion bluetooth branding bzip2 cairo caps cdda cddb cdparanoia cdr cli crypt css cups curl cxx dbus declarative dga djvu dri dts dvd dvdr emboss encode exif expat fbcon ffmpeg fftw flac fontconfig foomaticdb fortran ftp gd gdbm geoip gif gimp glamor gmp gnutls gphoto2 gpm graphviz gtk handbook iconv icu idn imagemagick imlib ipv6 java javascript jbig jpeg jpeg2k kde kipi kwallet lame lcms libass libcaca libnotify libsamplerate lm_sensors lua lzma lzo mad mmap mng modules mp3 mp4 mpeg mplayer multilib musicbrainz ncurses nls nptl nsplugin offensive ogg openal opengl openmp pam pango pcre pdf phonon plasma png policykit postscript ppds pulseaudio qml qt3support qt5 rdesktop readline recode samba sctp sdl seccomp sndfile sockets speex spell sqlite ssl startup-notification subversion svg symlink syslog systemd sysvipc taglib theora threads tidy tiff truetype udev udisks unicode upower usb vaapi vcd vim-syntax vnc vorbis wayland widgets win32codecs wmf wxwidgets x264 xattr xcb xcomposite xine xml xpm xscreensaver xv xvid yahoo zlib" ABI_X86="64" ALSA_CARDS="hda-intel virmidi" APACHE2_MODULES="authn_core authz_core socache_shmcb unixd actions alias auth_basic authn_alias authn_anon authn_dbm authn_default authn_file authz_dbm authz_default authz_groupfile authz_host authz_owner authz_user autoindex cache cgi cgid dav dav_fs dav_lock deflate dir disk_cache env expires ext_filter file_cache filter headers include info log_config logio mem_cache mime mime_magic negotiation rewrite setenvif speling status unique_id userdir usertrack vhost_alias" CALLIGRA_FEATURES="karbon plan sheets stage words" CAMERAS="kodak ptp2" COLLECTD_PLUGINS="df interface irq load memory rrdtool swap syslog" CPU_FLAGS_X86="aes avx mmx mmxext pclmul popcnt sse sse2 sse3 sse4_1 sse4_2 ssse3" CURL_SSL="gnutls" ELIBC="glibc" GPSD_PROTOCOLS="ashtech aivdm earthmate evermore fv18 garmin garmintxt gpsclock isync itrax mtk3301 nmea ntrip navcom oceanserver oldstyle oncore rtcm104v2 rtcm104v3 sirf skytraq superstar2 timing tsip tripmate tnt ublox ubx" GRUB_PLATFORMS="pc" INPUT_DEVICES="libinput" KERNEL="linux" L10N="it en" LCD_DEVICES="bayrad cfontz cfontz633 glk hd44780 lb216 lcdm001 mtxorb ncurses text" LIBREOFFICE_EXTENSIONS="nlpsolver" OFFICE_IMPLEMENTATION="libreoffice" PHP_TARGETS="php5-6 php7-0" POSTGRES_TARGETS="postgres9_5" PYTHON_SINGLE_TARGET="python3_6" PYTHON_TARGETS="python2_7 python3_6 pypy pypy3" RUBY_TARGETS="ruby22 ruby23" USERLAND="GNU" VIDEO_CARDS="intel i965" XTABLES_ADDONS="quota2 psd pknock lscan length2 ipv4options ipset ipp2p iface geoip fuzzy condition tee tarpit sysrq steal rawnat logmark ipmark dhcpmac delude chaos account"

                        Package Settings

dev-python/testtools-2.3.0::gentoo was built with the following:
USE="test -doc" ABI_X86="(64)" PYTHON_TARGETS="pypy pypy3 python2_7 python3_6 -python3_4 -python3_5"
CFLAGS="-O2 -pipe -march=sandybridge -msahf --param l1-cache-size=32 --param l1-cache-line-size=64 --param l2-cache-size=8192 -flto=8 -fuse-linker-plugin"
CXXFLAGS="-O2 -pipe -march=sandybridge -msahf --param l1-cache-size=32 --param l1-cache-line-size=64 --param l2-cache-size=8192 -flto=8 -fuse-linker-plugin"
LDFLAGS="-Wl,-O1 -Wl,--as-needed -Wl,--hash-style=gnu -Wl,--sort-common -flto=8 -fuse-linker-plugin"

# emerge -1pqv =dev-python/testtools-2.3.0
[ebuild   R   ] dev-python/testtools-2.3.0  USE="{test} -doc" PYTHON_TARGETS="pypy pypy3 python2_7 python3_6 -python3_4 -python3_5"