Gentoo Websites Logo
Go to: Gentoo Home Documentation Forums Lists Bugs Planet Store Wiki Get Gentoo!
Bug 653782 - sys-devel/automake-1.11.6-r3 fails tests python5.test python7.test python11.test
Summary: sys-devel/automake-1.11.6-r3 fails tests python5.test python7.test python11.test
Status: UNCONFIRMED
Alias: None
Product: Gentoo Linux
Classification: Unclassified
Component: Current packages (show other bugs)
Hardware: All Linux
: Normal normal (vote)
Assignee: Gentoo's Team for Core System packages
URL:
Whiteboard:
Keywords: TESTFAILURE
Depends on:
Blocks:
 
Reported: 2018-04-22 13:24 UTC by eroen
Modified: 2018-10-09 23:28 UTC (History)
0 users

See Also:
Package list:
Runtime testing required: ---


Attachments
/var/log/portage/build/sys-devel/automake-1.11.6-r3:20180421-213343.log (automake-1.11.6-r3:20180421-213343.log,38.94 KB, text/plain)
2018-04-22 13:24 UTC, eroen
Details
automake-1.11.6/tests/test-suite.log (test-suite.log,254.28 KB, text/plain)
2018-04-22 13:27 UTC, eroen
Details
build.log (ppc64) (automake-1.11.6-r3:20181009-223641.log,39.33 KB, text/plain)
2018-10-09 22:56 UTC, ernsteiswuerfel
Details
test-suite.log (ppc64) (test-suite.log,272.02 KB, text/plain)
2018-10-09 22:56 UTC, ernsteiswuerfel
Details

Note You need to log in before you can comment on or make changes to this bug.
Description eroen 2018-04-22 13:24:39 UTC
Created attachment 528224 [details]
/var/log/portage/build/sys-devel/automake-1.11.6-r3:20180421-213343.log

Some other tests have failed for a while, see bug 454818 and bug 532076.

...
FAIL: compile_f90_c_cxx.test
...
FAIL: primary-prefix-invalid-couples.test
...
FAIL: python5.test
PASS: python6.test
FAIL: python7.test
PASS: python8.test
PASS: python9.test
FAIL: python11.test
...
=====================================
5 of 910 tests failed
(41 tests were not run)
See tests/test-suite.log
Please report to bug-automake@gnu.org
=====================================
make[3]: *** [Makefile:1373: test-suite.log] Error 1
make[3]: Leaving directory '/var/tmp/portage/sys-devel/automake-1.11.6-r3/work/automake-1.11.6/tests'
make[2]: *** [Makefile:1453: check-TESTS] Error 2
make[2]: Leaving directory '/var/tmp/portage/sys-devel/automake-1.11.6-r3/work/automake-1.11.6/tests'
make[1]: *** [Makefile:1535: check-am] Error 2
make[1]: Leaving directory '/var/tmp/portage/sys-devel/automake-1.11.6-r3/work/automake-1.11.6/tests'
make: *** [Makefile:534: check-recursive] Error 1
 * ERROR: sys-devel/automake-1.11.6-r3::gentoo failed (test phase):
 *   Make check failed. See above for details.
 * 
 * Call stack:
 *            ebuild.sh, line  124:  Called src_test
 *          environment, line 2013:  Called default
 *   phase-functions.sh, line  858:  Called default_src_test
 *   phase-functions.sh, line  887:  Called __eapi0_src_test
 *     phase-helpers.sh, line  810:  Called die
 * The specific snippet of code:
 *   		$emake_cmd ${internal_opts} check || \
 *   			die "Make check failed. See above for details."
Comment 1 eroen 2018-04-22 13:27:20 UTC
Created attachment 528226 [details]
automake-1.11.6/tests/test-suite.log

FAIL: python5.test (exit: 1)
============================

/var/tmp/portage/sys-devel/automake-1.11.6-r3/work/automake-1.11.6/tests:/var/tmp/portage/sys-devel/automake-1.11.6-r3/temp/python2.7/bin:/usr/lib/portage/python3.6/ebuild-helpers/xattr:/usr/lib/portage/python3.6/ebuild-helpers:/usr/local/sbin:/usr/local/bin:/usr/sbin:/usr/bin:/sbin:/bin:/usr/x86_64-pc-linux-gnu/gcc-bin/7.2.0:/usr/x86_64-pc-linux-gnu/arm-none-eabi/gcc-bin/7.2.0:/usr/lib/llvm/5/bin:/usr/lib/llvm/4/bin:/usr/local/sbin:/usr/local/bin:/usr/sbin:/usr/bin:/sbin:/bin:/opt/bin
=== Running test ./python5.test
++ pwd
/var/tmp/portage/sys-devel/automake-1.11.6-r3/work/automake-1.11.6/tests/python5.dir
+ set -e
+ cat
+ :
+ aclocal-1.11 -Werror
+ autoconf -B /no/such/dir
+ automake-1.11 --foreign -Werror -Wall --add-missing
+ ./configure
checking for a BSD-compatible install... /usr/lib/portage/python3.6/ebuild-helpers/xattr/install -c
checking whether build environment is sane... yes
checking for a thread-safe mkdir -p... /bin/mkdir -p
checking for gawk... gawk
checking whether make sets $(MAKE)... yes
checking whether /usr/bin/python2.7 version >= 9999.9... + cat stderr
configure: error: too old
+ grep 'no suitable Python interpreter found' stderr
+ exit_status=1
+ set +e
+ cd /var/tmp/portage/sys-devel/automake-1.11.6-r3/work/automake-1.11.6/tests
+ case $exit_status,$keep_testdirs in
+ test 0 '!=' 0
+ echo 'python5: exit 1'
python5: exit 1
+ exit 1

FAIL: python7.test (exit: 1)
============================

/var/tmp/portage/sys-devel/automake-1.11.6-r3/work/automake-1.11.6/tests:/var/tmp/portage/sys-devel/automake-1.11.6-r3/temp/python2.7/bin:/usr/lib/portage/python3.6/ebuild-helpers/xattr:/usr/lib/portage/python3.6/ebuild-helpers:/usr/local/sbin:/usr/local/bin:/usr/sbin:/usr/bin:/sbin:/bin:/usr/x86_64-pc-linux-gnu/gcc-bin/7.2.0:/usr/x86_64-pc-linux-gnu/arm-none-eabi/gcc-bin/7.2.0:/usr/lib/llvm/5/bin:/usr/lib/llvm/4/bin:/usr/local/sbin:/usr/local/bin:/usr/sbin:/usr/bin:/sbin:/bin:/opt/bin
=== Running test ./python7.test
++ pwd
/var/tmp/portage/sys-devel/automake-1.11.6-r3/work/automake-1.11.6/tests/python7.dir
+ set -e
+ cat
+ :
+ aclocal-1.11 -Werror
+ autoconf -B /no/such/dir
+ automake-1.11 --foreign -Werror -Wall --add-missing
+ ./configure
checking for a BSD-compatible install... /usr/lib/portage/python3.6/ebuild-helpers/xattr/install -c
checking whether build environment is sane... yes
checking for a thread-safe mkdir -p... /bin/mkdir -p
checking for gawk... gawk
checking whether make sets $(MAKE)... yes
checking whether /usr/bin/python2.7 version >= 9999.9... + cat stderr
configure: error: too old
+ Exit 1
+ set +e
+ exit 1
+ exit 1
+ exit_status=1
+ set +e
+ cd /var/tmp/portage/sys-devel/automake-1.11.6-r3/work/automake-1.11.6/tests
+ case $exit_status,$keep_testdirs in
+ test 0 '!=' 0
+ echo 'python7: exit 1'
python7: exit 1
+ exit 1

FAIL: python11.test (exit: 1)
=============================

/var/tmp/portage/sys-devel/automake-1.11.6-r3/work/automake-1.11.6/tests:/var/tmp/portage/sys-devel/automake-1.11.6-r3/temp/python2.7/bin:/usr/lib/portage/python3.6/ebuild-helpers/xattr:/usr/lib/portage/python3.6/ebuild-helpers:/usr/local/sbin:/usr/local/bin:/usr/sbin:/usr/bin:/sbin:/bin:/usr/x86_64-pc-linux-gnu/gcc-bin/7.2.0:/usr/x86_64-pc-linux-gnu/arm-none-eabi/gcc-bin/7.2.0:/usr/lib/llvm/5/bin:/usr/lib/llvm/4/bin:/usr/local/sbin:/usr/local/bin:/usr/sbin:/usr/bin:/sbin:/bin:/opt/bin
=== Running test ./python11.test
++ pwd
/var/tmp/portage/sys-devel/automake-1.11.6-r3/work/automake-1.11.6/tests/python11.dir
+ set -e
+ cat
+ :
+ aclocal-1.11 -Werror
+ autoconf -B /no/such/dir
+ ./configure
+ cat stdout
checking for a BSD-compatible install... /usr/lib/portage/python3.6/ebuild-helpers/xattr/install -c
checking whether build environment is sane... yes
checking for a thread-safe mkdir -p... /bin/mkdir -p
checking for gawk... gawk
checking whether make sets $(MAKE)... yes
checking for python version... 2.7
checking for python platform... linux2
checking for python script directory... ${prefix}/lib64/python2.7/site-packages
checking for python extension module directory... ${exec_prefix}/lib64/python2.7/site-packages
PYTHON = /usr/bin/python2.7
+ cat stderr
+ grep 'checking for IShouldNotExist1' stdout
+ exit_status=1
+ set +e
+ cd /var/tmp/portage/sys-devel/automake-1.11.6-r3/work/automake-1.11.6/tests
+ case $exit_status,$keep_testdirs in
+ test 0 '!=' 0
+ echo 'python11: exit 1'
python11: exit 1
+ exit 1
Comment 2 eroen 2018-04-22 13:28:30 UTC
occam ~ # emerge --info '=sys-devel/automake-1.11.6-r3::gentoo'
Portage 2.3.31 (python 3.6.5-final-0, default/linux/amd64/17.0/hardened, gcc-7.2.0, glibc-2.26-r6, 4.15.3-gentoo-o0 x86_64)
=================================================================
                         System Settings
=================================================================
System uname: Linux-4.15.3-gentoo-o0-x86_64-Intel-R-_Core-TM-_i5-2520M_CPU_@_2.50GHz-with-gentoo-2.4.1
KiB Mem:     8001552 total,   2462936 free
KiB Swap:   16777212 total,  15340976 free
Timestamp of repository gentoo: Sat, 21 Apr 2018 20:00:01 +0000
Head commit of repository gentoo: a066e5d80f69677f5344d09255e0753b910067a4
Timestamp of repository eroen: Sun, 30 Oct 2016 21:58:42 +0000
Head commit of repository sapher: 9ef31d0bf6a902342746fb03a445d4f8b7ddabef

Head commit of repository wiktorb: 722797c27affae074c3d7b0a628cad1bdff2041c

Head commit of repository gentoo-snappy: 0ea79c799ebe1bc6cd924b9dd707b710eea24e83

Head commit of repository stuff: a1ca873e0ac59c49c5a848cec0f2c5ea0dd0d567

sh bash 4.4_p19
ld GNU ld (Gentoo 2.29.1 p2) 2.29.1
ccache version 3.3.4 [disabled]
app-shells/bash:          4.4_p19::gentoo
dev-java/java-config:     2.2.0-r3::gentoo
dev-lang/perl:            5.26.1-r2::gentoo
dev-lang/python:          2.7.14-r1::gentoo, 3.4.8::gentoo, 3.5.5::gentoo, 3.6.5::gentoo
dev-util/ccache:          3.3.4-r1::gentoo
dev-util/cmake:           3.11.1::gentoo
dev-util/pkgconfig:       0.29.2::gentoo
sys-apps/baselayout:      2.4.1-r2::gentoo
sys-apps/openrc:          0.35.5::gentoo
sys-apps/sandbox:         2.13::gentoo
sys-devel/autoconf:       2.13::gentoo, 2.69-r4::gentoo
sys-devel/automake:       1.13.4-r2::gentoo, 1.14.1-r2::gentoo, 1.15.1-r2::gentoo, 1.16.1-r1::gentoo
sys-devel/binutils:       2.29.1-r1::gentoo, 2.30-r1::gentoo
sys-devel/gcc:            6.4.0-r1::gentoo, 7.2.0-r1::gentoo, 7.3.0-r1::gentoo
sys-devel/gcc-config:     1.9.1::gentoo
sys-devel/libtool:        2.4.6-r5::gentoo
sys-devel/make:           4.2.1-r3::gentoo
sys-kernel/linux-headers: 4.16-r1::gentoo (virtual/os-headers)
sys-libs/glibc:           2.26-r6::gentoo
Repositories:

gentoo
    location: /usr/portage
    sync-type: rsync
    sync-uri: rsync://rsync.gentoo.org/gentoo-portage
    priority: -1000
    sync-rsync-verify-max-age: 24
    sync-rsync-extra-opts: --exclude ChangeLog* --exclude /metadata/cache/ --stats --delay-updates -c
    sync-rsync-verify-metamanifest: yes
    sync-rsync-verify-jobs: 1

crossdev
    location: /var/lib/portage/crossdev
    masters: gentoo gamerlay eroen

eroen
    location: /usr/local/portage
    masters: gentoo
    priority: 0

sapher
    location: /var/lib/overlays/sapher
    sync-type: git
    sync-uri: https://github.com/apinsard/sapher-overlay.git
    masters: gentoo

wiktorb
    location: /var/lib/overlays/wiktorb
    sync-type: git
    sync-uri: https://github.com/wiktor-b/overlay.git
    masters: gentoo

dotnet
    location: /var/lib/layman/dotnet
    masters: gentoo
    priority: 50

enlightenment
    location: /var/lib/layman/enlightenment
    masters: gentoo
    priority: 50

flora
    location: /var/lib/layman/flora
    masters: gentoo
    priority: 50

gamerlay
    location: /var/lib/layman/gamerlay
    masters: gentoo
    priority: 50

gentoo-snappy
    location: /usr/local/portage/gentoo-snappy
    sync-type: git
    sync-uri: https://github.com/zyga/gentoo-snappy.git
    masters: gentoo
    priority: 50

glc
    location: /var/lib/layman/glc
    masters: gentoo
    priority: 50

hardened-development
    location: /var/lib/layman/hardened-development
    masters: gentoo
    priority: 50

haskell
    location: /var/lib/layman/haskell
    masters: gentoo
    priority: 50

hasufell
    location: /var/lib/layman/hasufell
    masters: gentoo
    priority: 50

java
    location: /var/lib/layman/java
    masters: gentoo
    priority: 50

laurentb
    location: /var/lib/layman/laurentb
    masters: gentoo
    priority: 50

roslin
    location: /var/lib/layman/roslin
    masters: gentoo
    priority: 50

stuff
    location: /var/lib/layman/stuff
    sync-type: git
    sync-uri: https://github.com/istitov/stuff.git
    masters: gentoo
    priority: 50

sunrise
    location: /var/lib/layman/sunrise
    masters: gentoo
    priority: 50

toolchain
    location: /var/lib/layman/toolchain
    masters: gentoo
    priority: 50

v-fox
    location: /var/lib/layman/v-fox
    masters: gentoo
    priority: 50

ACCEPT_KEYWORDS="amd64 ~amd64"
ACCEPT_LICENSE="*"
CBUILD="x86_64-pc-linux-gnu"
CFLAGS="-march=corei7-avx -pipe -Og -g -gdwarf-4"
CHOST="x86_64-pc-linux-gnu"
CONFIG_PROTECT="/etc /usr/share/config /usr/share/easy-rsa /usr/share/gnupg/qualified.txt"
CONFIG_PROTECT_MASK="/etc/ca-certificates.conf /etc/dconf /etc/env.d /etc/fonts/fonts.conf /etc/gconf /etc/gentoo-release /etc/revdep-rebuild /etc/sandbox.d /etc/terminfo /etc/texmf/language.dat.d /etc/texmf/language.def.d /etc/texmf/updmap.d /etc/texmf/web2c"
CXXFLAGS="-march=corei7-avx -pipe -Og -g -gdwarf-4"
DISTDIR="/var/distfiles"
EMERGE_DEFAULT_OPTS="--jobs=1 --autounmask --quiet-build --nospinner --verbose-conflicts --verbose-slot-rebuilds"
FCFLAGS="-O2 -pipe"
FEATURES="assume-digests binpkg-logs binpkg-multi-instance cgroup collision-protect compressdebug config-protect-if-modified distlocks ebuild-locks fixlafiles installsources ipc-sandbox merge-sync multilib-strict network-sandbox news parallel-fetch parallel-install preserve-libs protect-owned sandbox sfperms split-log splitdebug strict strict-keepdir test unknown-features-warn unmerge-logs unmerge-orphans userfetch userpriv usersandbox usersync xattr"
FFLAGS="-O2 -pipe"
GENTOO_MIRRORS=""
LANG="en_GB.utf8"
LDFLAGS="-Wl,-O1 -Wl,--as-needed -Wl,--hash-style=gnu"
LINGUAS="en gb us en_US en_GB eng jbo no nb nn no_NO nb_NO nn_NO nor"
MAKEOPTS="-j4 -l10"
PKGDIR="/var/packages"
PORTAGE_CONFIGROOT="/"
PORTAGE_RSYNC_EXTRA_OPTS="--exclude ChangeLog* --exclude /metadata/cache/ --stats --delay-updates -c"
PORTAGE_RSYNC_OPTS="--recursive --links --safe-links --perms --times --omit-dir-times --compress --force --whole-file --delete --stats --human-readable --timeout=180 --exclude=/distfiles --exclude=/local --exclude=/packages --exclude=/.git"
PORTAGE_TMPDIR="/var/tmp"
USE="X a52 aac acl alsa amd64 apng audio audiofile avresample avx bash-completion bdf bluray bzip2 cairo caps cb cdda cdparanoia cdr cjk corefonts crypt cups curl cxx ddate declarative detex device-mapper dga dia djvu dts dvd dvi2tty dvipdfm ebook egl exif fam ffmpeg fftw fits flac fontconfig g3dvl gallium gbm gcrypt gif gimp git glamor glib glibc-omitfp gmp gnuplot gnutls gold gpm graphics graphviz gs gstreamer gtk gtk3 hardened highlight hscolour iconv icu id3tag idn imagemagick imlib inotify iproute2 ipv6 jbig jpeg jpeg2k jpg json kde kde4 kpathsea latex lcms libffi libssh2 libv4l luatex lvm lvm2 lzma lzo man metric mikmod mkv mms mmx mng mp3 mpeg mpg123 multilib multimedia musepack ncurses netlink nptl nut ocr odbc offensive ogg opengl openmp openvg optimization optimized-qmake opus pam pango pcre pdf pgf phonon pie png postscript private-headers pstricks pth publishers python3 qt3support qt4 raw readline samba sbsms scanner science sdl seccomp smp sna sndfile speex spell sqlite sse sse2 sse3 sse4 sse41 sse4_1 sse4_2 ssh ssl ssp ssse3 svg t1lib tesseract theora threads tiff tls truetype udev unicode usb v4l v4l2 vaapi video vorbis vpx webp wmf x264 xanim xattr xcb xcomposite xetex xft xinerama xkb xml xmlpatterns xorg xosd xpm xrandr xtpax xv xvid xvmc xz zlib zsh-completion" ABI_X86="32 64" APACHE2_MODULES="authn_core authz_core socache_shmcb unixd actions alias auth_basic authn_alias authn_anon authn_dbm authn_default authn_file authz_dbm authz_default authz_groupfile authz_host authz_owner authz_user autoindex cache cgi cgid dav dav_fs dav_lock deflate dir disk_cache env expires ext_filter file_cache filter headers include info log_config logio mem_cache mime mime_magic negotiation rewrite setenvif speling status unique_id userdir usertrack vhost_alias" CALLIGRA_FEATURES="karbon plan sheets stage words" COLLECTD_PLUGINS="df interface irq load memory rrdtool swap syslog" CPU_FLAGS_X86="mmx sse sse2 avx sse3 ssse3 sse4_1 aes avx mmxext popcnt sse3 sse4_1 sse4_2 ssse3" CURL_SSL="openssl" ELIBC="glibc" GPSD_PROTOCOLS="ashtech aivdm earthmate evermore fv18 garmin garmintxt gpsclock isync itrax mtk3301 nmea ntrip navcom oceanserver oldstyle oncore rtcm104v2 rtcm104v3 sirf skytraq superstar2 timing tsip tripmate tnt ublox ubx" GRUB_PLATFORMS="efi-64" INPUT_DEVICES="evdev synaptics" KERNEL="linux" L10N="en en-US en-GB eng" LCD_DEVICES="bayrad cfontz cfontz633 glk hd44780 lb216 lcdm001 mtxorb ncurses text" LIBREOFFICE_EXTENSIONS="presenter-console presenter-minimizer" LLVM_TARGETS="AArch64 ARM BPF X86" OFFICE_IMPLEMENTATION="libreoffice" PHP_TARGETS="php5-3" POSTGRES_TARGETS="postgres10" PYTHON_SINGLE_TARGET="python3_6" PYTHON_TARGETS="python2_7 python3_4 python3_5 python3_6" QEMU_SOFTMMU_TARGETS="x86_64 i386" RUBY_TARGETS="ruby22" SANE_BACKENDS="plustek" USERLAND="GNU" VIDEO_CARDS="intel i965 ilo" XTABLES_ADDONS="quota2 psd pknock lscan length2 ipv4options ipset ipp2p iface geoip fuzzy condition tee tarpit sysrq steal rawnat logmark ipmark dhcpmac delude chaos account"
Unset:  CC, CPPFLAGS, CTARGET, CXX, ENV_UNSET, INSTALL_MASK, LC_ALL, PORTAGE_BINHOST, PORTAGE_BUNZIP2_COMMAND, PORTAGE_COMPRESS, PORTAGE_COMPRESS_FLAGS

occam ~ # emerge -pqv '=sys-devel/automake-1.11.6-r3::gentoo'
[ebuild  NS   ] sys-devel/automake-1.11.6-r3 [1.13.4-r2, 1.14.1-r2, 1.15.1-r2, 1.16.1-r1] USE="{test}" 

!!! The following installed packages are masked:
- sys-firmware/intel-microcode-20180108-r1::gentoo (masked by: package.mask)
/usr/portage/profiles/package.mask:
# Thomas Deutschmann <whissi@gentoo.org> (07 Feb 2018)
# Intel recommends to pull these versions because they could
# cause higher than expected reboots and other unpredictable
# system behavior. Bug #646646

- x11-libs/libXp-1.0.3::gentoo (masked by: package.mask)
/usr/portage/profiles/package.mask:
# Matt Turner <mattst88@gentoo.org> (21 Apr 2018)
# Protocol headers and client library for the long dead Xprint extension.
# Removal in 30 days. Bug #649076.

- x11-proto/printproto-1.0.5-r1::gentoo (masked by: package.mask)
- sci-electronics/qucs-9999::eroen (masked by: package.mask)
/usr/portage/profiles/package.mask:
# Andreas Sturmlechner <asturm@gentoo.org> (03 Apr 2018)
# Build issues, depends on dead Qt4, no port to Qt5 (or far from ready).
# Masked for removal in 30 days. Bugs #620474, #624740, #648668

- sys-block/targetcli-9999::gentoo (masked by: package.mask)
/usr/portage/profiles/package.mask:
# Pacho Ramos <pacho@gentoo.org> (17 Mar 2018)
# Branch unmaintained for a long time (#593878). Migrate to dev-python/rtslib-fb
# and sys-block/targetcli-fb. Removal in a month.

- dev-python/rtslib-9999::gentoo (masked by: package.mask)
For more information, see the MASKED PACKAGES section in the emerge
man page or refer to the Gentoo Handbook.
Comment 3 ernsteiswuerfel 2018-10-09 22:56:20 UTC
Created attachment 550296 [details]
build.log (ppc64)

Same here with automake-1.11.6-r3 on ppc64.
Comment 4 ernsteiswuerfel 2018-10-09 22:56:57 UTC
Created attachment 550298 [details]
test-suite.log (ppc64)
Comment 5 Thomas Deutschmann gentoo-dev Security 2018-10-09 23:28:06 UTC
This is known but we won't fix 1.11.x anymore. Please concentrate on 1.16.x.