Gentoo Websites Logo
Go to: Gentoo Home Documentation Forums Lists Bugs Planet Store Wiki Get Gentoo!
Bug 653046 - www-client/falkon-3.0.0: test failures
Summary: www-client/falkon-3.0.0: test failures
Status: CONFIRMED
Alias: None
Product: Gentoo Linux
Classification: Unclassified
Component: Current packages (show other bugs)
Hardware: All Linux
: Normal normal (vote)
Assignee: Gentoo KDE team
URL:
Whiteboard:
Keywords: TESTFAILURE
Depends on:
Blocks: 652056
  Show dependency tree
 
Reported: 2018-04-12 19:12 UTC by Thomas Deutschmann
Modified: 2019-02-09 16:54 UTC (History)
0 users

See Also:
Package list:
Runtime testing required: ---


Attachments
build.log (build.log.gz,48.24 KB, application/gzip)
2018-04-12 19:12 UTC, Thomas Deutschmann
Details
LastTest.log (LastTest.log,23.84 KB, text/plain)
2018-04-12 19:12 UTC, Thomas Deutschmann
Details
LastTest.log v3.0.1 (LastTest.log,30.89 KB, text/plain)
2019-02-09 16:49 UTC, Thomas Deutschmann
Details

Note You need to log in before you can comment on or make changes to this bug.
Description Thomas Deutschmann gentoo-dev Security 2018-04-12 19:12:23 UTC
Created attachment 527222 [details]
build.log

Test project /var/tmp/portage/www-client/falkon-3.0.0/work/falkon-3.0.0_build
      Start  1: falkon-qztoolstest
 1/10 Test  #1: falkon-qztoolstest ............................   Passed    1.59 sec
      Start  2: falkon-cookiestest
 2/10 Test  #2: falkon-cookiestest ............................***Exception: Other  2.77 sec
      Start  3: falkon-adblocktest
 3/10 Test  #3: falkon-adblocktest ............................   Passed    0.13 sec
      Start  4: falkon-updatertest
 4/10 Test  #4: falkon-updatertest ............................   Passed    0.09 sec
      Start  5: falkon-locationbartest
 5/10 Test  #5: falkon-locationbartest ........................***Exception: Other  0.66 sec
      Start  6: falkon-webviewtest
 6/10 Test  #6: falkon-webviewtest ............................***Exception: Other  0.70 sec
      Start  7: falkon-webtabtest
 7/10 Test  #7: falkon-webtabtest .............................***Exception: Other  0.57 sec
      Start  8: falkon-tabmodeltest
 8/10 Test  #8: falkon-tabmodeltest ...........................***Exception: Other  0.48 sec
      Start  9: falkon-databasepasswordbackendtest
 9/10 Test  #9: falkon-databasepasswordbackendtest ............   Passed    1.09 sec
      Start 10: falkon-databaseencryptedpasswordbackendtest
10/10 Test #10: falkon-databaseencryptedpasswordbackendtest ...   Passed    1.03 sec

50% tests passed, 5 tests failed out of 10

Total Test time (real) =   9.16 sec

The following tests FAILED:
          2 - falkon-cookiestest (OTHER_FAULT)
          5 - falkon-locationbartest (OTHER_FAULT)
          6 - falkon-webviewtest (OTHER_FAULT)
          7 - falkon-webtabtest (OTHER_FAULT)
          8 - falkon-tabmodeltest (OTHER_FAULT)
Errors while running CTest



Portage 2.3.24 (python 3.5.4-final-0, default/linux/x86/17.0, gcc-6.4.0, glibc-2.25-r11, 4.9.76-gentoo-r1 i686)
=================================================================
System uname: Linux-4.9.76-gentoo-r1-i686-Intel-R-_Core-TM-_i7-3770K_CPU_@_3.50GHz-with-gentoo-2.4.1
KiB Mem:     3108324 total,   1344380 free
KiB Swap:     488276 total,    487872 free
Timestamp of repository gentoo: Thu, 12 Apr 2018 16:09:12 +0000
Head commit of repository gentoo: bdd6fce114b0dd3122896504769c3cca3fc57531

sh bash 4.4_p12
ld GNU ld (Gentoo 2.29.1 p3) 2.29.1
app-shells/bash:          4.4_p12::gentoo
dev-java/java-config:     2.2.0-r3::gentoo
dev-lang/perl:            5.24.3-r1::gentoo
dev-lang/python:          2.7.14-r1::gentoo, 3.5.4-r1::gentoo
dev-util/cmake:           3.9.6::gentoo
dev-util/pkgconfig:       0.29.2::gentoo
sys-apps/baselayout:      2.4.1-r2::gentoo
sys-apps/openrc:          0.34.11::gentoo
sys-apps/sandbox:         2.13::gentoo
sys-devel/autoconf:       2.13::gentoo, 2.69-r4::gentoo
sys-devel/automake:       1.9.6-r5::gentoo, 1.10.3-r3::gentoo, 1.11.6-r3::gentoo, 1.12.6-r2::gentoo, 1.13.4-r2::gentoo, 1.14.1-r2::gentoo, 1.15.1-r2::gentoo
sys-devel/binutils:       2.29.1-r1::gentoo
sys-devel/gcc:            6.4.0-r1::gentoo
sys-devel/gcc-config:     1.8-r1::gentoo
sys-devel/libtool:        2.4.6-r3::gentoo
sys-devel/make:           4.2.1::gentoo
sys-kernel/linux-headers: 4.13::gentoo (virtual/os-headers)
sys-libs/glibc:           2.25-r11::gentoo
Repositories:

gentoo
    location: /usr/portage
    sync-type: git
    sync-uri: https://github.com/gentoo-mirror/gentoo.git
    priority: -1000

ABI="x86"
ABI_X86="32"
ACCEPT_KEYWORDS="x86"
ACCEPT_LICENSE="* -@EULA"
ACCEPT_PROPERTIES="*"
ACCEPT_RESTRICT="*"
ANT_HOME="/usr/share/ant"
ARCH="x86"
CBUILD="i686-pc-linux-gnu"
CFLAGS="-O2 -pipe -march=pentium4m -mtune=pentium4m"
CHOST="i686-pc-linux-gnu"
CHOST_x86="i686-pc-linux-gnu"
COLLISION_IGNORE="/lib/modules/* *.py[co] *$py.class */dropin.cache"
CONFIG_PROTECT="/etc /usr/share/config /usr/share/gnupg/qualified.txt"
CPU_FLAGS_X86="mmx mmxext sse sse2"
CXXFLAGS="-O2 -pipe -march=pentium4m -mtune=pentium4m"
DEFAULT_ABI="x86"
EDITOR="/usr/bin/mcedit"
ELIBC="glibc"
EPREFIX=""
EROOT="/"
FCFLAGS="-O2 -march=i686 -pipe"
FEATURES="assume-digests binpkg-logs cgroup config-protect-if-modified distlocks downgrade-backup ebuild-locks fixlafiles merge-sync multilib-strict news parallel-fetch preserve-libs protect-owned sandbox sfperms strict unknown-features-warn unmerge-logs unmerge-orphans userfetch userpriv usersandbox usersync xattr"
FFLAGS="-O2 -march=i686 -pipe"
GCC_SPECS=""
GRUB_PLATFORMS="efi-32 pc"
GSETTINGS_BACKEND="dconf"
GUILE_LOAD_PATH="/usr/share/guile/1.8"
HOME="/root"
INFOPATH="/usr/share/gcc-data/i686-pc-linux-gnu/6.4.0/info:/usr/share/binutils-data/i686-pc-linux-gnu/2.29.1/info:/usr/share/info:/usr/share/info/emacs-25"
INPUT_DEVICES="libinput keyboard mouse"
IUSE_IMPLICIT="abi_x86_32 prefix prefix-chain prefix-guest"
JAVAC="/etc/java-config-2/current-system-vm/bin/javac"
JAVA_HOME="/etc/java-config-2/current-system-vm"
JDK_HOME="/etc/java-config-2/current-system-vm"
KERNEL="linux"
L10N="en en-US de de-DE"
LADSPA_PATH="/usr/lib/ladspa"
LANG="en_US.UTF-8"
LC_ALL="en_US.UTF-8"
LC_MESSAGES="C"
LC_PAPER="de_DE.UTF-8"
LDFLAGS="-Wl,-O1 -Wl,--as-needed"
LIBDIR_x86="lib"
LINGUAS="en de"
LOGNAME="root"
MAIL="/var/mail/root"
MAKEOPTS="--jobs 5 --load-average 7.95"
MANPAGER="manpager"
MOZ_GMP_PATH="/usr/lib/nsbrowser/plugins/gmp-gmpopenh264/system-installed"
MULTILIB_ABIS="x86"
NOCOLOR="true"
OFFICE_IMPLEMENTATION="libreoffice"
OLDPWD="/root"
OPENGL_PROFILE="xorg-x11"
PAGER="/usr/bin/less"
PATH="/usr/i686-pc-linux-gnu/gcc-bin/6.4.0:/usr/lib/llvm/5/bin:/usr/local/sbin:/usr/local/bin:/usr/sbin:/usr/bin:/sbin:/bin:/opt/bin"
PHP_TARGETS="php5-6 php7-0"
POSTGRES_TARGETS="postgres9_5"
PWD="/tmp/stable"
PYTHONDONTWRITEBYTECODE="1"
PYTHON_SINGLE_TARGET="python3_5"
PYTHON_TARGETS="python2_7 python3_5"
QT_GRAPHICSSYSTEM="raster"
ROOT="/"
ROOTPATH="/usr/i686-pc-linux-gnu/gcc-bin/6.4.0:/usr/lib/llvm/5/bin:/usr/local/sbin:/usr/local/bin:/usr/sbin:/usr/bin:/sbin:/bin:/opt/bin"
RUBY_TARGETS="ruby22 ruby23"
SCHEME_LIBRARY_PATH="/usr/share/slib/"
SHELL="/bin/bash"
SHLVL="2"
SSH_TTY="/dev/pts/0"
TERM="screen"
TMUX="/tmp/tmux-0/default,5002,0"
TMUX_PANE="%1"
TWISTED_DISABLE_WRITING_OF_PLUGIN_CACHE="1"
USER="root"
USERLAND="GNU"
VIDEO_CARDS="vmware"
XDG_CONFIG_DIRS="/etc/xdg"
XDG_DATA_DIRS="/usr/local/share:/usr/share"
Comment 1 Thomas Deutschmann gentoo-dev Security 2018-04-12 19:12:40 UTC
Created attachment 527224 [details]
LastTest.log
Comment 2 Andreas Sturmlechner gentoo-dev 2018-04-13 09:58:46 UTC
I assume you have virtualx set up? amd64 had the same test failures, but were solved after I added VIRTUALX_REQUIRED=test to the ebuild...
Comment 3 Thomas Deutschmann gentoo-dev Security 2018-04-15 18:50:59 UTC
(In reply to Andreas Sturmlechner from comment #2)
> I assume you have virtualx set up? amd64 had the same test failures, but
> were solved after I added VIRTUALX_REQUIRED=test to the ebuild...
Sorry, I don't understand that question. I expect that VIRTUALX eclass will handle anything on its own. I didn't take any manual steps.

However, errors looks like a crash for me, so nothing virtualx related.
Comment 4 Thomas Deutschmann gentoo-dev Security 2019-02-09 16:49:21 UTC
Created attachment 564382 [details]
LastTest.log v3.0.1

Still failing:

>>> Source compiled.
>>> Test phase: www-client/falkon-3.0.1-r1
 * Scanning for an open DISPLAY to start Xvfb ...
 * Starting Xvfb on $DISPLAY=0 ...
>>> Working in BUILD_DIR: "/var/tmp/portage/www-client/falkon-3.0.1-r1/work/falkon-3.0.1_build"
ctest -j 5 --test-load 7.95
Invalid value for 'Test Load' : 7.95
Test project /var/tmp/portage/www-client/falkon-3.0.1-r1/work/falkon-3.0.1_build
      Start  1: falkon-qztoolstest
 1/10 Test  #1: falkon-qztoolstest ............................   Passed    1.37 sec
      Start  2: falkon-cookiestest
 2/10 Test  #2: falkon-cookiestest ............................***Failed    4.54 sec
      Start  3: falkon-adblocktest
 3/10 Test  #3: falkon-adblocktest ............................   Passed    0.05 sec
      Start  4: falkon-updatertest
 4/10 Test  #4: falkon-updatertest ............................   Passed    0.04 sec
      Start  5: falkon-locationbartest
 5/10 Test  #5: falkon-locationbartest ........................***Failed    0.58 sec
      Start  6: falkon-webviewtest
 6/10 Test  #6: falkon-webviewtest ............................***Failed    0.55 sec
      Start  7: falkon-webtabtest
 7/10 Test  #7: falkon-webtabtest .............................***Failed    0.69 sec
      Start  8: falkon-tabmodeltest
 8/10 Test  #8: falkon-tabmodeltest ...........................***Failed    0.82 sec
      Start  9: falkon-databasepasswordbackendtest
 9/10 Test  #9: falkon-databasepasswordbackendtest ............   Passed    1.11 sec
      Start 10: falkon-databaseencryptedpasswordbackendtest
10/10 Test #10: falkon-databaseencryptedpasswordbackendtest ...   Passed    1.06 sec

50% tests passed, 5 tests failed out of 10

Total Test time (real) =  10.83 sec

The following tests FAILED:
	  2 - falkon-cookiestest (Failed)
	  5 - falkon-locationbartest (Failed)
	  6 - falkon-webviewtest (Failed)
	  7 - falkon-webtabtest (Failed)
	  8 - falkon-tabmodeltest (Failed)
Errors while running CTest
 * ERROR: www-client/falkon-3.0.1-r1::gentoo failed (test phase):
 *   Tests failed. When you file a bug, please attach the following file: 
 * 	/var/tmp/portage/www-client/falkon-3.0.1-r1/work/falkon-3.0.1_build/Testing/Temporary/LastTest.log
 *
Comment 5 Larry the Git Cow gentoo-dev 2019-02-09 16:54:04 UTC
The bug has been referenced in the following commit(s):

https://gitweb.gentoo.org/repo/gentoo.git/commit/?id=aa890cb7ecfb8129e93ae06dbcf5fea9cfbcfcfc

commit aa890cb7ecfb8129e93ae06dbcf5fea9cfbcfcfc
Author:     Andreas Sturmlechner <asturm@gentoo.org>
AuthorDate: 2019-02-09 16:52:59 +0000
Commit:     Andreas Sturmlechner <asturm@gentoo.org>
CommitDate: 2019-02-09 16:53:51 +0000

    www-client/falkon: Tests don't work for everyone.
    
    Bug: https://bugs.gentoo.org/653046
    Package-Manager: Portage-2.3.59, Repoman-2.3.12
    Signed-off-by: Andreas Sturmlechner <asturm@gentoo.org>

 www-client/falkon/falkon-3.0.1-r1.ebuild | 3 +++
 1 file changed, 3 insertions(+)