Gentoo Websites Logo
Go to: Gentoo Home Documentation Forums Lists Bugs Planet Store Wiki Get Gentoo!
Bug 649236 - games-action/btanks-0.9.8083 : clunk/source.cpp:157:70: error: pow10f was not declared in this scope
Summary: games-action/btanks-0.9.8083 : clunk/source.cpp:157:70: error: pow10f was not...
Status: CONFIRMED
Alias: None
Product: Gentoo Linux
Classification: Unclassified
Component: Current packages (show other bugs)
Hardware: All Linux
: Normal normal (vote)
Assignee: Gentoo Games
URL:
Whiteboard:
Keywords:
Depends on:
Blocks:
 
Reported: 2018-03-01 16:41 UTC by Toralf Förster
Modified: 2018-03-02 10:06 UTC (History)
1 user (show)

See Also:
Package list:
Runtime testing required: ---


Attachments
emerge-info.txt (emerge-info.txt,17.07 KB, text/plain)
2018-03-01 16:41 UTC, Toralf Förster
Details
emerge-history.txt (emerge-history.txt,212.46 KB, text/plain)
2018-03-01 16:41 UTC, Toralf Förster
Details
environment (environment,99.38 KB, text/plain)
2018-03-01 16:41 UTC, Toralf Förster
Details
etc.portage.tbz2 (etc.portage.tbz2,14.72 KB, application/x-bzip)
2018-03-01 16:41 UTC, Toralf Förster
Details
games-action:btanks-0.9.8083:20180301-102312.log (games-action:btanks-0.9.8083:20180301-102312.log,10.00 KB, text/plain)
2018-03-01 16:41 UTC, Toralf Förster
Details
logs.tbz2 (logs.tbz2,1.09 KB, application/x-bzip)
2018-03-01 16:41 UTC, Toralf Förster
Details
temp.tbz2 (temp.tbz2,25.09 KB, application/x-bzip)
2018-03-01 16:41 UTC, Toralf Förster
Details

Note You need to log in before you can comment on or make changes to this bug.
Description Toralf Förster gentoo-dev 2018-03-01 16:41:09 UTC
clunk/source.cpp: In member function ‘void clunk::Source::hrtf(int, unsigned int, clunk::Buffer&, const Sint16*, int, int, int, const float (* const&)[2][512], int)’:
clunk/source.cpp:157:70: error: ‘pow10f’ was not declared in this scope
   float m = pow10f(kemar_data[kemar_idx][0][kemar_angle_idx] * v / 20);
                                                                      ^
scons: *** [build/release/clunk/source.os] Error 1

  -------------------------------------------------------------------

  This is an unstable amd64 chroot image at a tinderbox (==build bot)
  name: 17.0-desktop-plasma_20180224-093310

  -------------------------------------------------------------------

gcc-config -l:
 [1] x86_64-pc-linux-gnu-5.4.0 *

Available Python interpreters, in order of preference:
  [1]   python3.5
  [2]   python2.7 (fallback)
  [3]   pypy3 (fallback)
Available Ruby profiles:
  [1]   ruby22 (with Rubygems)
  [2]   ruby23 (with Rubygems) *
java-config:
The following VMs are available for generation-2:
*)	IcedTea JDK 3.6.0 [icedtea-bin-8]
2)	JamVM JDK 2.0.0 [jamvm]
Available Java Virtual Machines:
  [1]   icedtea-bin-8  system-vm
  [2]   jamvm 

emerge -qpv games-action/btanks
[ebuild  N    ] games-action/btanks-0.9.8083
Comment 1 Toralf Förster gentoo-dev 2018-03-01 16:41:12 UTC
Created attachment 521656 [details]
emerge-info.txt
Comment 2 Toralf Förster gentoo-dev 2018-03-01 16:41:15 UTC
Created attachment 521658 [details]
emerge-history.txt
Comment 3 Toralf Förster gentoo-dev 2018-03-01 16:41:18 UTC
Created attachment 521660 [details]
environment
Comment 4 Toralf Förster gentoo-dev 2018-03-01 16:41:21 UTC
Created attachment 521662 [details]
etc.portage.tbz2
Comment 5 Toralf Förster gentoo-dev 2018-03-01 16:41:24 UTC
Created attachment 521664 [details]
games-action:btanks-0.9.8083:20180301-102312.log
Comment 6 Toralf Förster gentoo-dev 2018-03-01 16:41:27 UTC
Created attachment 521666 [details]
logs.tbz2
Comment 7 Toralf Förster gentoo-dev 2018-03-01 16:41:30 UTC
Created attachment 521668 [details]
temp.tbz2