Gentoo Websites Logo
Go to: Gentoo Home Documentation Forums Lists Bugs Planet Store Wiki Get Gentoo!
Bug 644850 - app-admin/diradm- fails tests on profile 17.1 ( couldn't execute "/usr/lib/openldap/slapd": no such file or directory )
Summary: app-admin/diradm- fails tests on profile 17.1 ( couldn't execute "/usr...
Alias: None
Product: Gentoo Linux
Classification: Unclassified
Component: Current packages (show other bugs)
Hardware: All Linux
: Normal normal (vote)
Assignee: Robin Johnson
Depends on:
Blocks: no-symlink-lib
  Show dependency tree
Reported: 2018-01-17 13:12 UTC by Kent Fredric (IRC: kent\n) (RETIRED)
Modified: 2018-07-24 16:35 UTC (History)
0 users

See Also:
Package list:
Runtime testing required: ---


Note You need to log in before you can comment on or make changes to this bug.
Description Kent Fredric (IRC: kent\n) (RETIRED) gentoo-dev 2018-01-17 13:12:57 UTC
qlist openldap | grep 'slapd$'


                === diradm tests ===

Schedule of variations:

Running target unix
Using /usr/share/dejagnu/baseboards/unix.exp as board description file for target.
Using /usr/share/dejagnu/config/unix.exp as generic interface file for target.
Using /var/tmp/portage/app-admin/diradm- as tool-and-target-specific interface file.
ERROR: tcl error sourcing tool-and-target-specific interface file /var/tmp/portage/app-admin/diradm-
couldn't execute "/usr/lib/openldap/slapd": no such file or directory
couldn't execute "/usr/lib/openldap/slapd": no such file or directory
    while executing
"open [concat "|$executable" $params]"
    (procedure "cmd-run" line 19)
    invoked from within
"cmd-run $configdir $cmd"
    (procedure "slapd_start" line 11)
    invoked from within
    (procedure "diradm_start" line 6)
    invoked from within
    (file "/var/tmp/portage/app-admin/diradm-" line 72)
    invoked from within
"source /var/tmp/portage/app-admin/diradm-"
    ("uplevel" body line 1)
    invoked from within
"uplevel #0 source /var/tmp/portage/app-admin/diradm-"
make[2]: *** [Makefile:384: check-DEJAGNU] Error 1
make[2]: Leaving directory '/var/tmp/portage/app-admin/diradm-'
make[1]: *** [Makefile:565: check-am] Error 2
make[1]: Leaving directory '/var/tmp/portage/app-admin/diradm-'
make: *** [Makefile:260: check-recursive] Error 1

Portage 2.3.13 (python 2.7.14-final-0, default/linux/amd64/17.1/no-multilib, gcc-7.2.0, glibc-2.25-r9, 4.9.6-gentoo-r1 x86_64)
System uname: Linux-4.9.6-gentoo-r1-x86_64-Intel-R-_Core-TM-2_Duo_CPU_E6750_@_2.66GHz-with-gentoo-2.4.1
KiB Mem:     2042732 total,    232480 free
KiB Swap:   18588764 total,  18563596 free
Head commit of repository gentoo: 2f7c60b31db36129c58b790c6e2a304fde6b0246

sh bash 4.4_p12
ld GNU ld (Gentoo 2.29.1 p3) 2.29.1
ccache version 3.2.4 [enabled]
app-shells/bash:          4.4_p12::gentoo
dev-lang/perl:            5.28.9999::gentoo
dev-lang/python:          2.7.14-r1::gentoo, 3.5.4-r1::gentoo
dev-util/ccache:          3.2.4::gentoo
sys-apps/baselayout:      2.4.1-r2::gentoo
sys-apps/openrc:          0.34.11::gentoo
sys-apps/sandbox:         2.12::gentoo
sys-devel/autoconf:       2.69-r4::gentoo
sys-devel/automake:       1.15.1-r1::gentoo
sys-devel/binutils:       2.29.1-r1::gentoo
sys-devel/gcc:            7.2.0-r1::gentoo
sys-devel/gcc-config:     1.8-r1::gentoo
sys-devel/libtool:        2.4.6-r3::gentoo
sys-devel/make:           4.2.1::gentoo
sys-kernel/linux-headers: 4.13::gentoo (virtual/os-headers)
sys-libs/glibc:           2.25-r9::gentoo

    location: /usr/portage
    sync-type: git
    priority: -1000