Gentoo Websites Logo
Go to: Gentoo Home Documentation Forums Lists Bugs Planet Store Wiki Get Gentoo!
Bug 643264 - dev-db/redis-4.0.6 fails tests on hardened: [err]: Cant' start the Redis server
Summary: dev-db/redis-4.0.6 fails tests on hardened: [err]: Cant' start the Redis server
Status: CONFIRMED
Alias: None
Product: Gentoo Linux
Classification: Unclassified
Component: Current packages (show other bugs)
Hardware: All Linux
: Normal normal (vote)
Assignee: Ultrabug
URL:
Whiteboard:
Keywords: TESTFAILURE
: 647884 (view as bug list)
Depends on:
Blocks:
 
Reported: 2018-01-03 15:34 UTC by Toralf Förster
Modified: 2018-05-19 07:59 UTC (History)
2 users (show)

See Also:
Package list:
Runtime testing required: ---


Attachments
emerge-info.txt (emerge-info.txt,17.05 KB, text/plain)
2018-01-03 15:34 UTC, Toralf Förster
Details
dev-db:redis-4.0.6:20180103-131202.log (dev-db:redis-4.0.6:20180103-131202.log,90.20 KB, text/plain)
2018-01-03 15:34 UTC, Toralf Förster
Details
emerge-history.txt (emerge-history.txt,152.80 KB, text/plain)
2018-01-03 15:34 UTC, Toralf Förster
Details
environment (environment,121.26 KB, text/plain)
2018-01-03 15:34 UTC, Toralf Förster
Details
etc.portage.tbz2 (etc.portage.tbz2,17.52 KB, application/x-bzip)
2018-01-03 15:34 UTC, Toralf Förster
Details
logs.tbz2 (logs.tbz2,6.84 KB, application/x-bzip)
2018-01-03 15:34 UTC, Toralf Förster
Details
temp.tbz2 (temp.tbz2,36.54 KB, application/x-bzip)
2018-01-03 15:34 UTC, Toralf Förster
Details
tests.tbz2 (tests.tbz2,86.66 KB, application/x-bzip)
2018-01-03 15:34 UTC, Toralf Förster
Details
emerge-info.txt (emerge-info.txt,16.82 KB, text/plain)
2018-05-19 07:59 UTC, Toralf Förster
Details
dev-db:redis-4.0.9:20180519-001431.log (dev-db:redis-4.0.9:20180519-001431.log,88.30 KB, text/plain)
2018-05-19 07:59 UTC, Toralf Förster
Details
emerge-history.txt (emerge-history.txt,208.43 KB, text/plain)
2018-05-19 07:59 UTC, Toralf Förster
Details
environment (environment,119.47 KB, text/plain)
2018-05-19 07:59 UTC, Toralf Förster
Details
etc.portage.tbz2 (etc.portage.tbz2,13.76 KB, application/x-bzip)
2018-05-19 07:59 UTC, Toralf Förster
Details
logs.tbz2 (logs.tbz2,5.97 KB, application/x-bzip)
2018-05-19 07:59 UTC, Toralf Förster
Details
temp.tbz2 (temp.tbz2,35.64 KB, application/x-bzip)
2018-05-19 07:59 UTC, Toralf Förster
Details
tests.tbz2 (tests.tbz2,86.98 KB, application/x-bzip)
2018-05-19 07:59 UTC, Toralf Förster
Details

Note You need to log in before you can comment on or make changes to this bug.
Description Toralf Förster gentoo-dev 2018-01-03 15:34:00 UTC
Killing still running Redis server 12370

make[1]: *** [Makefile:236: test] Error 1
make[1]: Leaving directory '/var/tmp/portage/dev-db/redis-4.0.6/work/redis-4.0.6/src'
make: *** [Makefile:6: check] Error 2
 * ERROR: dev-db/redis-4.0.6::gentoo failed (test phase):

  -------------------------------------------------------------------

  This is an unstable amd64 chroot image at a tinderbox (==build bot)
  name: 17.0-no-multilib-hardened_libressl-test_20171229-182601

  -------------------------------------------------------------------

gcc-config -l:
 [1] x86_64-pc-linux-gnu-7.2.0 *

Available Python interpreters, in order of preference:
  [1]   python3.5
  [2]   python2.7 (fallback)

java-config:
The following VMs are available for generation-2:
*)	IcedTea JDK 3.6.0 [icedtea-bin-8]
Available Java Virtual Machines:
  [1]   icedtea-bin-8  system-vm

emerge -qpv dev-db/redis
[ebuild  N    ] dev-db/redis-4.0.6  USE="jemalloc -luajit -tcmalloc {-test}"
Comment 1 Toralf Förster gentoo-dev 2018-01-03 15:34:03 UTC
Created attachment 513060 [details]
emerge-info.txt
Comment 2 Toralf Förster gentoo-dev 2018-01-03 15:34:06 UTC
Created attachment 513062 [details]
dev-db:redis-4.0.6:20180103-131202.log
Comment 3 Toralf Förster gentoo-dev 2018-01-03 15:34:09 UTC
Created attachment 513064 [details]
emerge-history.txt
Comment 4 Toralf Förster gentoo-dev 2018-01-03 15:34:12 UTC
Created attachment 513066 [details]
environment
Comment 5 Toralf Förster gentoo-dev 2018-01-03 15:34:15 UTC
Created attachment 513068 [details]
etc.portage.tbz2
Comment 6 Toralf Förster gentoo-dev 2018-01-03 15:34:18 UTC
Created attachment 513070 [details]
logs.tbz2
Comment 7 Toralf Förster gentoo-dev 2018-01-03 15:34:21 UTC
Created attachment 513072 [details]
temp.tbz2
Comment 8 Toralf Förster gentoo-dev 2018-01-03 15:34:24 UTC
Created attachment 513074 [details]
tests.tbz2
Comment 9 Tomáš Mózes 2018-01-03 15:59:53 UTC
Just tested on ~amd64 with default/linux/amd64/17.0 profile and it runs the tests fine.

Early after starting the tests I see this in your dev-db:redis-4.0.6:20180103-131202.log:
[err]: Cant' start the Redis server
Comment 10 Tomáš Mózes 2018-02-16 17:34:26 UTC
*** Bug 647884 has been marked as a duplicate of this bug. ***
Comment 11 Toralf Förster gentoo-dev 2018-05-19 07:59:21 UTC
got at the unstable amd64 chroot image 17.0-hardened_test_20180512-194415 this : make[1]: *** [Makefile:<snip>: test] Error 1
Comment 12 Toralf Förster gentoo-dev 2018-05-19 07:59:24 UTC
Created attachment 532186 [details]
emerge-info.txt
Comment 13 Toralf Förster gentoo-dev 2018-05-19 07:59:27 UTC
Created attachment 532188 [details]
dev-db:redis-4.0.9:20180519-001431.log
Comment 14 Toralf Förster gentoo-dev 2018-05-19 07:59:30 UTC
Created attachment 532190 [details]
emerge-history.txt
Comment 15 Toralf Förster gentoo-dev 2018-05-19 07:59:33 UTC
Created attachment 532192 [details]
environment
Comment 16 Toralf Förster gentoo-dev 2018-05-19 07:59:36 UTC
Created attachment 532194 [details]
etc.portage.tbz2
Comment 17 Toralf Förster gentoo-dev 2018-05-19 07:59:39 UTC
Created attachment 532196 [details]
logs.tbz2
Comment 18 Toralf Förster gentoo-dev 2018-05-19 07:59:43 UTC
Created attachment 532198 [details]
temp.tbz2
Comment 19 Toralf Förster gentoo-dev 2018-05-19 07:59:46 UTC
Created attachment 532200 [details]
tests.tbz2