Gentoo Websites Logo
Go to: Gentoo Home Documentation Forums Lists Bugs Planet Store Wiki Get Gentoo!
Bug 642772 - dev-ros/tf2-0.5.16-r1 : [TEST] /.../speed_test.cpp:101:3: error: logInform was not declared in this scope
Summary: dev-ros/tf2-0.5.16-r1 : [TEST] /.../speed_test.cpp:101:3: error: logInform wa...
Status: CONFIRMED
Alias: None
Product: Gentoo Linux
Classification: Unclassified
Component: Current packages (show other bugs)
Hardware: All Linux
: Normal normal (vote)
Assignee: Robot Operating System team
URL:
Whiteboard:
Keywords: TESTFAILURE
Depends on:
Blocks:
 
Reported: 2017-12-30 23:13 UTC by Toralf Förster
Modified: 2017-12-30 23:13 UTC (History)
0 users

See Also:
Package list:
Runtime testing required: ---


Attachments
emerge-info.txt (emerge-info.txt,15.33 KB, text/plain)
2017-12-30 23:13 UTC, Toralf Förster
Details
dev-ros:tf2-0.5.16-r1:20171230-230457.log (dev-ros:tf2-0.5.16-r1:20171230-230457.log,37.84 KB, text/plain)
2017-12-30 23:13 UTC, Toralf Förster
Details
emerge-history.txt (emerge-history.txt,49.48 KB, text/plain)
2017-12-30 23:13 UTC, Toralf Förster
Details
environment (environment,160.86 KB, text/plain)
2017-12-30 23:13 UTC, Toralf Förster
Details
etc.portage.tbz2 (etc.portage.tbz2,12.17 KB, application/x-bzip)
2017-12-30 23:13 UTC, Toralf Förster
Details
logs.tbz2 (logs.tbz2,5.17 KB, application/x-bzip)
2017-12-30 23:13 UTC, Toralf Förster
Details
temp.tbz2 (temp.tbz2,37.57 KB, application/x-bzip)
2017-12-30 23:13 UTC, Toralf Förster
Details

Note You need to log in before you can comment on or make changes to this bug.
Description Toralf Förster gentoo-dev 2017-12-30 23:13:16 UTC
/usr/bin/x86_64-pc-linux-gnu-g++  -I/var/tmp/portage/dev-ros/tf2-0.5.16-r1/work/geometry2-0.5.16/tf2/src/bt -I/var/tmp/portage/dev-ros/tf2-0.5.16-r1/work/geometry2-0.5.16/tf2/include -I//usr/include   -DNDEBUG -O2 -pipe -march=native -std=c++11   -o CMakeFiles/speed_test.dir/test/speed_test.cpp.o -c /var/tmp/portage/dev-ros/tf2-0.5.16-r1/work/geometry2-0.5.16/tf2/test/speed_test.cpp
/var/tmp/portage/dev-ros/tf2-0.5.16-r1/work/geometry2-0.5.16/tf2/test/speed_test.cpp: In function ‘int main(int, char**)’:
/var/tmp/portage/dev-ros/tf2-0.5.16-r1/work/geometry2-0.5.16/tf2/test/speed_test.cpp:101:3: error: ‘logInform’ was not declared in this scope
   logInform("%s to %s", v_frame0.c_str(), v_frame1.c_str());
   ^~~~~~~~~
make[3]: *** [CMakeFiles/speed_test.dir/build.make:63: CMakeFiles/speed_test.dir/test/speed_test.cpp.o] Error 1

  -------------------------------------------------------------------

  This is an unstable amd64 chroot image at a tinderbox (==build bot)
  name: 17.0-no-multilib-hardened_libressl-test_20171229-182601

  -------------------------------------------------------------------

gcc-config -l:
 [1] x86_64-pc-linux-gnu-7.2.0 *

Available Python interpreters, in order of preference:
  [1]   python3.5
  [2]   python2.7 (fallback)

java-config:
The following VMs are available for generation-2:
*)	IcedTea JDK 3.6.0 [icedtea-bin-8]
Available Java Virtual Machines:
  [1]   icedtea-bin-8  system-vm

emerge -qpv dev-ros/tf2
[ebuild  N    ] dev-ros/tf2-0.5.16-r1  USE="{-test}" PYTHON_TARGETS="python2_7"
Comment 1 Toralf Förster gentoo-dev 2017-12-30 23:13:19 UTC
Created attachment 512104 [details]
emerge-info.txt
Comment 2 Toralf Förster gentoo-dev 2017-12-30 23:13:22 UTC
Created attachment 512106 [details]
dev-ros:tf2-0.5.16-r1:20171230-230457.log
Comment 3 Toralf Förster gentoo-dev 2017-12-30 23:13:25 UTC
Created attachment 512108 [details]
emerge-history.txt
Comment 4 Toralf Förster gentoo-dev 2017-12-30 23:13:28 UTC
Created attachment 512110 [details]
environment
Comment 5 Toralf Förster gentoo-dev 2017-12-30 23:13:31 UTC
Created attachment 512112 [details]
etc.portage.tbz2
Comment 6 Toralf Förster gentoo-dev 2017-12-30 23:13:34 UTC
Created attachment 512114 [details]
logs.tbz2
Comment 7 Toralf Förster gentoo-dev 2017-12-30 23:13:36 UTC
Created attachment 512116 [details]
temp.tbz2