Gentoo Websites Logo
Go to: Gentoo Home Documentation Forums Lists Bugs Planet Store Wiki Get Gentoo!
Bug 641946 - app-editors/vim-8.0.1298 fails test Test_filetype_detection
Summary: app-editors/vim-8.0.1298 fails test Test_filetype_detection
Status: UNCONFIRMED
Alias: None
Product: Gentoo Linux
Classification: Unclassified
Component: Current packages (show other bugs)
Hardware: All Linux
: Normal normal (vote)
Assignee: Vim Maintainers
URL:
Whiteboard:
Keywords:
Depends on:
Blocks:
 
Reported: 2017-12-21 16:09 UTC by Paolo Pedroni
Modified: 2018-06-07 17:02 UTC (History)
1 user (show)

See Also:
Package list:
Runtime testing required: ---


Attachments
vim-8.0.1298:20171221-155848.log.gz (vim-8.0.1298:20171221-155848.log.gz,343.37 KB, application/gzip)
2017-12-21 16:09 UTC, Paolo Pedroni
Details
build.log (build.log.xz,124.27 KB, application/x-xz)
2018-03-26 18:59 UTC, tka
Details

Note You need to log in before you can comment on or make changes to this bug.
Description Paolo Pedroni 2017-12-21 16:09:49 UTC
Created attachment 511400 [details]
vim-8.0.1298:20171221-155848.log.gz

Executed 339 tests
1 FAILED:
Found errors in Test_filetype_detection():
function RunTheTest[34]..Test_filetype_detection[2]..CheckItems line 9: with file name: /.config/git/config: Expected 'gitconfig' but got ''
function RunTheTest[34]..Test_filetype_detection[2]..CheckItems line 9: with file name: /.config/upstart/file.conf: Expected 'upstart' but got ''
function RunTheTest[34]..Test_filetype_detection[2]..CheckItems line 9: with file name: /.config/upstart/file.override: Expected 'upstart' but got ''


From test_alot.vim:
Found errors in Test_filetype_detection():
function RunTheTest[34]..Test_filetype_detection[2]..CheckItems line 9: with file name: /.config/git/config: Expected 'gitconfig' but got ''
function RunTheTest[34]..Test_filetype_detection[2]..CheckItems line 9: with file name: /.config/upstart/file.conf: Expected 'upstart' but got ''
function RunTheTest[34]..Test_filetype_detection[2]..CheckItems line 9: with file name: /.config/upstart/file.override: Expected 'upstart' but got ''

Test results:


From test_alot.vim:
Found errors in Test_filetype_detection():
function RunTheTest[34]..Test_filetype_detection[2]..CheckItems line 9: with file name: /.config/git/config: Expected 'gitconfig' but got ''
function RunTheTest[34]..Test_filetype_detection[2]..CheckItems line 9: with file name: /.config/upstart/file.conf: Expected 'upstart' but got ''
function RunTheTest[34]..Test_filetype_detection[2]..CheckItems line 9: with file name: /.config/upstart/file.override: Expected 'upstart' but got ''
TEST FAILURE
make: *** [Makefile:42: report] Error 1
make: Leaving directory '/var/tmp/portage/app-editors/vim-8.0.1298/work/vim-8.0.1298/src/testdir'
 * ERROR: app-editors/vim-8.0.1298::gentoo failed (test phase)

# emerge --info =app-editors/vim-8.0.1298
Portage 2.3.13 (python 3.5.4-final-0, default/linux/amd64/17.0/desktop, gcc-7.2.0, glibc-2.25-r9, 4.14.8-gentoo-r1 x86_64)
=================================================================
                         System Settings
=================================================================
System uname: Linux-4.14.8-gentoo-r1-x86_64-AMD_Phenom-tm-_II_X4_965_Processor-with-gentoo-2.4.1
KiB Mem:    12269484 total,  10355204 free
KiB Swap:    8351740 total,   8351740 free
Timestamp of repository gentoo: Thu, 21 Dec 2017 08:15:01 +0000
Head commit of repository gentoo: bc1aa3e62e2a8c024ffefa5f32cd4a233a05bd93
sh dash 0.5.9.1-r3
ld GNU gold (Gentoo 2.29.1 p3 2.29.1) 1.14
distcc 3.2rc1 x86_64-pc-linux-gnu [enabled]
ccache version 3.3.4 [disabled]
app-shells/bash:          4.3_p48-r1::gentoo
dev-lang/perl:            5.26.1-r1::gentoo
dev-lang/python:          2.7.14-r1::gentoo, 3.5.4-r1::gentoo
dev-util/ccache:          3.3.4-r1::gentoo
dev-util/cmake:           3.8.2::gentoo
dev-util/pkgconfig:       0.29.2::gentoo
sys-apps/baselayout:      2.4.1-r2::gentoo
sys-apps/sandbox:         2.10-r4::gentoo
sys-devel/autoconf:       2.13::gentoo, 2.69::gentoo
sys-devel/automake:       1.15.1-r1::gentoo
sys-devel/binutils:       2.29.1-r1::gentoo
sys-devel/gcc:            7.2.0::gentoo
sys-devel/gcc-config:     1.9.1::gentoo
sys-devel/libtool:        2.4.6-r3::gentoo
sys-devel/make:           4.2.1::gentoo
sys-kernel/linux-headers: 4.10::gentoo (virtual/os-headers)
sys-libs/glibc:           2.25-r9::gentoo
Repositories:

gentoo
    location: /usr/portage
    sync-type: rsync
    sync-uri: rsync://rsync.europe.gentoo.org/gentoo-portage
    priority: -1000
    sync-rsync-extra-opts: 

x-portage
    location: /usr/local/portage
    masters: gentoo
    priority: 0

ACCEPT_KEYWORDS="amd64"
ACCEPT_LICENSE="* -@EULA"
CBUILD="x86_64-pc-linux-gnu"
CFLAGS="-O2 -pipe -march=amdfam10 -msahf -mlzcnt -mpopcnt --param l1-cache-size=64 --param l1-cache-line-size=64 --param l2-cache-size=512 -flto=5 -fuse-linker-plugin -floop-nest-optimize -ftree-loop-distribution -fgraphite-identity -ftree-vectorize"
CHOST="x86_64-pc-linux-gnu"
CONFIG_PROTECT="/etc /usr/lib64/libreoffice/program/sofficerc /usr/share/config /usr/share/gnupg/qualified.txt"
CONFIG_PROTECT_MASK="/etc/ca-certificates.conf /etc/dconf /etc/env.d /etc/fonts/fonts.conf /etc/gconf /etc/gentoo-release /etc/revdep-rebuild /etc/sandbox.d /etc/terminfo"
CXXFLAGS="-O2 -pipe -march=amdfam10 -msahf -mlzcnt -mpopcnt --param l1-cache-size=64 --param l1-cache-line-size=64 --param l2-cache-size=512 -flto=5 -fuse-linker-plugin -floop-nest-optimize -ftree-loop-distribution -fgraphite-identity -ftree-vectorize"
DISTDIR="/usr/portage/distfiles"
EMERGE_DEFAULT_OPTS="--keep-going y --with-bdeps y"
FCFLAGS="-O2 -pipe"
FEATURES="assume-digests binpkg-logs cgroup compress-build-logs config-protect-if-modified distcc distlocks ebuild-locks ipc-sandbox merge-sync multilib-strict news parallel-fetch protect-owned sandbox sfperms split-elog split-log strict test unknown-features-warn unmerge-logs unmerge-orphans userfetch userpriv usersandbox usersync xattr"
FFLAGS="-O2 -pipe"
GENTOO_MIRRORS="http://ftp-stud.hs-esslingen.de/pub/Mirrors/gentoo/ ftp://mirror.switch.ch/mirror/gentoo/ http://gentoo.mirror.dkm.cz/pub/gentoo/ http://ftp.halifax.rwth-aachen.de/gentoo/ http://ftp.uni-erlangen.de/pub/mirrors/gentoo"
LANG="it_IT.UTF-8"
LDFLAGS="-Wl,-O1 -Wl,--as-needed -Wl,--hash-style=gnu -Wl,--sort-common -flto=5 -fuse-linker-plugin -floop-nest-optimize -ftree-loop-distribution -fgraphite-identity -ftree-vectorize"
MAKEOPTS="-j12 -l4"
PKGDIR="/usr/portage/packages"
PORTAGE_CONFIGROOT="/"
PORTAGE_RSYNC_OPTS="--recursive --links --safe-links --perms --times --omit-dir-times --compress --force --whole-file --delete --stats --human-readable --timeout=180 --exclude=/distfiles --exclude=/local --exclude=/packages --exclude=/.git"
PORTAGE_TMPDIR="/var/tmp"
USE="3dnow X a52 aac aalib acl acpi alsa amd64 ao audiofile bash-completion bluetooth branding bzip2 cairo caps cdda cddb cdparanoia cdr cli consolekit cracklib crypt css cups curl cxx dbus dga djvu dri dts dvd dvdr emboss encode exif expat fbcon ffmpeg fftw flac fontconfig fortran ftp gd gdbm gif glamor gmp gnutls gpm graphviz gtk iconv icu idn ieee1394 imagemagick imlib inotify introspection ipv6 jbig jpeg jpeg2k kde lame lcms libass libcaca libnotify libsamplerate lm_sensors lua lzma lzo mad mmap mng modules mp3 mp4 mpeg mplayer multilib musicbrainz ncurses nls nptl nsplugin offensive ogg openal openexr opengl openmp pam pango pcre pdf png policykit postscript ppds pulseaudio qt5 rdesktop readline samba sctp sdl seccomp session sndfile speex spell sqlite ssl startup-notification svg symlink syslog systemd taglib theora threads tiff truetype udev udisks unicode upower usb vaapi vcd vdpau vim-syntax vorbis wavpack wayland win32codecs wmf wxwidgets x264 xattr xcb xcomposite xine xinerama xml xpm xscreensaver xv xvid zlib" ABI_X86="64" ALSA_CARDS="hda-intel virmidi" APACHE2_MODULES="authn_core authz_core socache_shmcb unixd actions alias auth_basic authn_alias authn_anon authn_dbm authn_default authn_file authz_dbm authz_default authz_groupfile authz_host authz_owner authz_user autoindex cache cgi cgid dav dav_fs dav_lock deflate dir disk_cache env expires ext_filter file_cache filter headers include info log_config logio mem_cache mime mime_magic negotiation rewrite setenvif speling status unique_id userdir usertrack vhost_alias" CALLIGRA_FEATURES="kexi words flow plan sheets stage tables krita karbon braindump author" CAMERAS="kodak ptp2" COLLECTD_PLUGINS="df interface irq load memory rrdtool swap syslog" CPU_FLAGS_X86="3dnow 3dnowext mmx mmxext popcnt sse sse2 sse3 sse4a" CURL_SSL="gnutls" ELIBC="glibc" GPSD_PROTOCOLS="ashtech aivdm earthmate evermore fv18 garmin garmintxt gpsclock isync itrax mtk3301 nmea ntrip navcom oceanserver oldstyle oncore rtcm104v2 rtcm104v3 sirf skytraq superstar2 timing tsip tripmate tnt ublox ubx" GRUB_PLATFORMS="pc" INPUT_DEVICES="libinput" KERNEL="linux" L10N="it en" LCD_DEVICES="bayrad cfontz cfontz633 glk hd44780 lb216 lcdm001 mtxorb ncurses text" LINGUAS="it it_IT" OFFICE_IMPLEMENTATION="libreoffice" PHP_TARGETS="php5-6 php7-0" POSTGRES_TARGETS="postgres9_5" PYTHON_SINGLE_TARGET="python3_5" PYTHON_TARGETS="python2_7 python3_5 pypy pypy3" RUBY_TARGETS="ruby22" USERLAND="GNU" VIDEO_CARDS="radeon r600" XTABLES_ADDONS="quota2 psd pknock lscan length2 ipv4options ipset ipp2p iface geoip fuzzy condition tee tarpit sysrq steal rawnat logmark ipmark dhcpmac delude chaos account"
Unset:  CC, CPPFLAGS, CTARGET, CXX, INSTALL_MASK, LC_ALL, PORTAGE_BUNZIP2_COMMAND, PORTAGE_COMPRESS, PORTAGE_COMPRESS_FLAGS, PORTAGE_RSYNC_EXTRA_OPTS

# emerge -1pqv =app-editors/vim-8.0.1298
[ebuild     U ] app-editors/vim-8.0.1298 [8.0.0386] USE="X acl gpm lua nls -cscope -debug -luajit -minimal -perl -python -racket -ruby (-selinux) -tcl -terminal% -vim-pager" PYTHON_SINGLE_TARGET="python3_5%* -python2_7% (-python3_4) -python3_6%" PYTHON_TARGETS="python2_7 python3_5 -python3_4 -python3_6"
Comment 1 tka 2018-03-26 18:59:46 UTC
Created attachment 525616 [details]
build.log

I get a similar error; also in Test_filetype_detection but with 'grub' instead of 'upstart':
> Executed 349 tests
> 1 FAILED:
> Found errors in Test_filetype_detection():
> function RunTheTest[38]..Test_filetype_detection[2]..CheckItems line 9: with file name: /boot/grub/menu.lst: Expected 'grub' but got ''
> function RunTheTest[38]..Test_filetype_detection[2]..CheckItems line 9: with file name: /boot/grub/grub.conf: Expected 'grub' but got ''
> 
> 
> From test_alot.vim:
> Found errors in Test_filetype_detection():
> function RunTheTest[38]..Test_filetype_detection[2]..CheckItems line 9: with file name: /boot/grub/menu.lst: Expected 'grub' but got ''
> function RunTheTest[38]..Test_filetype_detection[2]..CheckItems line 9: with file name: /boot/grub/grub.conf: Expected 'grub' but got ''
> 
> Test results:
> 
> 
> From test_alot.vim:
> Found errors in Test_filetype_detection():
> function RunTheTest[38]..Test_filetype_detection[2]..CheckItems line 9: with file name: /boot/grub/menu.lst: Expected 'grub' but got ''
> function RunTheTest[38]..Test_filetype_detection[2]..CheckItems line 9: with file name: /boot/grub/grub.conf: Expected 'grub' but got ''
> TEST FAILURE
> make: *** [Makefile:42: report] Error 1

# emerge -pqv '=app-editors/vim-8.0.1645::gentoo'
[ebuild     U ] app-editors/vim-8.0.1645 [8.0.1428] USE="X acl -cscope -debug -gpm -lua -luajit -minimal -nls -perl -python -racket -ruby (-selinux) -tcl -terminal -vim-pager" PYTHON_SINGLE_TARGET="python3_5 -python2_7 -python3_4 -python3_6" PYTHON_TARGETS="python2_7 python3_5 -python3_4 -python3_6" 

# emerge --info '=app-editors/vim-8.0.1645::gentoo'
Portage 2.3.24 (python 3.5.4-final-0, default/linux/amd64/17.0/no-multilib/hardened, gcc-7.3.0, glibc-2.26-r6, 4.15.13 x86_64)
=================================================================
                         System Settings
=================================================================
System uname: Linux-4.15.13-x86_64-Intel-R-_Core-TM-_i7-3720QM_CPU_@_2.60GHz-with-gentoo-2.4.1
KiB Mem:    16388104 total,  11305716 free
KiB Swap:   17825788 total,  17825788 free
Timestamp of repository gentoo: Mon, 26 Mar 2018 18:00:01 +0000
Head commit of repository gentoo: e8e4002d9c22262bca86486d2d86a01620b151ce
sh bash 4.4_p19
ld GNU ld (Gentoo 2.30 p1) 2.30.0
app-shells/bash:          4.4_p19::gentoo
dev-java/java-config:     2.2.0-r4::gentoo
dev-lang/perl:            5.26.1-r2::gentoo
dev-lang/python:          2.7.14-r1::gentoo, 3.5.4-r1::gentoo, 3.6.4::gentoo
dev-util/cmake:           3.10.3::gentoo
dev-util/pkgconfig:       0.29.2::gentoo
sys-apps/baselayout:      2.4.1-r2::gentoo
sys-apps/openrc:          0.35.5::gentoo
sys-apps/sandbox:         2.13::gentoo
sys-devel/autoconf:       2.13::gentoo, 2.69-r4::gentoo
sys-devel/automake:       1.16.1-r1::gentoo
sys-devel/binutils:       2.30::gentoo
sys-devel/gcc:            6.4.0-r1::gentoo, 7.3.0::gentoo
sys-devel/gcc-config:     1.9.1::gentoo
sys-devel/libtool:        2.4.6-r5::gentoo
sys-devel/make:           4.2.1-r3::gentoo
sys-kernel/linux-headers: 4.15::gentoo (virtual/os-headers)
sys-libs/glibc:           2.26-r6::gentoo
Repositories:

gentoo
    location: /usr/portage
    sync-type: rsync
    sync-uri: rsync://rsync.gentoo.org/gentoo-portage
    priority: -1000
    sync-rsync-extra-opts: 
    sync-rsync-verify-metamanifest: yes

local
    location: /var/lib/portage-local/local
    masters: gentoo
    priority: 0

testing
    location: /var/lib/portage-local/testing
    masters: gentoo
    priority: 1

ACCEPT_KEYWORDS="amd64 ~amd64"
ACCEPT_LICENSE="* -@EULA"
CBUILD="x86_64-pc-linux-gnu"
CFLAGS="-march=native -mtune=native -O2 -pipe"
CHOST="x86_64-pc-linux-gnu"
CONFIG_PROTECT="/etc /usr/share/gnupg/qualified.txt"
CONFIG_PROTECT_MASK="/etc/ca-certificates.conf /etc/dconf /etc/env.d /etc/fonts/fonts.conf /etc/gconf /etc/gentoo-release /etc/revdep-rebuild /etc/sandbox.d /etc/terminfo /etc/texmf/language.dat.d /etc/texmf/language.def.d /etc/texmf/updmap.d /etc/texmf/web2c"
CXXFLAGS="-march=native -mtune=native -O2 -pipe"
DISTDIR="/usr/portage/distfiles"
EMERGE_DEFAULT_OPTS="--with-bdeps=y"
FCFLAGS="-O2 -pipe"
FEATURES="assume-digests binpkg-logs cgroup collision-protect config-protect-if-modified distlocks ebuild-locks fixlafiles ipc-sandbox merge-sync multilib-strict network-sandbox news parallel-fetch preserve-libs protect-owned sandbox sfperms strict test unknown-features-warn unmerge-logs unmerge-orphans userfetch userpriv usersandbox usersync xattr"
FFLAGS="-O2 -pipe"
GENTOO_MIRRORS="http://distfiles.gentoo.org"
LDFLAGS="-Wl,-O1 -Wl,--as-needed -Wl,--hash-style=gnu"
LINGUAS=""
MAKEOPTS="-j8"
PKGDIR="/usr/portage/packages"
PORTAGE_CONFIGROOT="/"
PORTAGE_RSYNC_OPTS="--recursive --links --safe-links --perms --times --omit-dir-times --compress --force --whole-file --delete --stats --human-readable --timeout=180 --exclude=/distfiles --exclude=/local --exclude=/packages --exclude=/.git"
PORTAGE_TMPDIR="/var/tmp"
USE="X a52 acl acpi alsa amd64 avx bzip2 cairo caps cdda cddb cdparanoia crypt cups cxx dbus dri dts dvd fam ffmpeg fftw flac fontconfig gif gimp gmp gnutls gtk hardened iconv icu idn ipv6 jpeg lame lcms libnotify lzma mad matroska mmap mmx mmxext mp3 mpeg ncurses networkmanager nptl ogg opengl openmp pam pcre pie png policykit ppds readline sasl sdl seccomp sse sse2 sse3 sse4 sse4_1 sse4_2 ssl ssp ssse3 startup-notification svg theora threads tiff truetype udev unicode upower vaapi vorbis wayland x264 xattr xcb xinerama xml xtpax xv xvid zlib" ABI_X86="64" ALSA_CARDS="ali5451 als4000 atiixp atiixp-modem bt87x ca0106 cmipci emu10k1x ens1370 ens1371 es1938 es1968 fm801 hda-intel intel8x0 intel8x0m maestro3 trident usb-audio via82xx via82xx-modem ymfpci" APACHE2_MODULES="authn_core authz_core socache_shmcb unixd actions alias auth_basic authn_alias authn_anon authn_dbm authn_default authn_file authz_dbm authz_default authz_groupfile authz_host authz_owner authz_user autoindex cache cgi cgid dav dav_fs dav_lock deflate dir disk_cache env expires ext_filter file_cache filter headers include info log_config logio mem_cache mime mime_magic negotiation rewrite setenvif speling status unique_id userdir usertrack vhost_alias" CALLIGRA_FEATURES="kexi words flow plan sheets stage tables krita karbon braindump author" COLLECTD_PLUGINS="df interface irq load memory rrdtool swap syslog" CPU_FLAGS_X86="aes avx f16c mmx mmxext popcnt sse sse2 sse3 sse4_1 sse4_2 ssse3" ELIBC="glibc" GPSD_PROTOCOLS="ashtech aivdm earthmate evermore fv18 garmin garmintxt gpsclock isync itrax mtk3301 nmea ntrip navcom oceanserver oldstyle oncore rtcm104v2 rtcm104v3 sirf skytraq superstar2 timing tsip tripmate tnt ublox ubx" GRUB_PLATFORMS="pc" INPUT_DEVICES="evdev synaptics" KERNEL="linux" LCD_DEVICES="bayrad cfontz cfontz633 glk hd44780 lb216 lcdm001 mtxorb ncurses text" LIBREOFFICE_EXTENSIONS="presenter-console presenter-minimizer" OFFICE_IMPLEMENTATION="libreoffice" PHP_TARGETS="php5-6 php7-0" POSTGRES_TARGETS="postgres9_5" PYTHON_SINGLE_TARGET="python3_5" PYTHON_TARGETS="python2_7 python3_5" RUBY_TARGETS="ruby22 ruby23" USERLAND="GNU" VIDEO_CARDS="i965 intel nouveau" XTABLES_ADDONS="quota2 psd pknock lscan length2 ipv4options ipset ipp2p iface geoip fuzzy condition tee tarpit sysrq steal rawnat logmark ipmark dhcpmac delude chaos account"
Unset:  CC, CPPFLAGS, CTARGET, CXX, INSTALL_MASK, LANG, LC_ALL, PORTAGE_BUNZIP2_COMMAND, PORTAGE_COMPRESS, PORTAGE_COMPRESS_FLAGS, PORTAGE_RSYNC_EXTRA_OPTS
Comment 2 tka 2018-06-07 17:02:04 UTC
Still happens with vim-8.1.0034:

Executing Test_z_overflow()
Executed 372 tests
1 FAILED:
Found errors in Test_filetype_detection():
function RunTheTest[38]..Test_filetype_detection[2]..CheckItems line 9: with file name: /boot/grub/menu.lst: Expected 'grub' but got ''
function RunTheTest[38]..Test_filetype_detection[2]..CheckItems line 9: with file name: /boot/grub/grub.conf: Expected 'grub' but got ''


From test_alot.vim:
Found errors in Test_filetype_detection():
function RunTheTest[38]..Test_filetype_detection[2]..CheckItems line 9: with file name: /boot/grub/menu.lst: Expected 'grub' but got ''
function RunTheTest[38]..Test_filetype_detection[2]..CheckItems line 9: with file name: /boot/grub/grub.conf: Expected 'grub' but got ''

Test results:


From test_alot.vim:
Found errors in Test_filetype_detection():
function RunTheTest[38]..Test_filetype_detection[2]..CheckItems line 9: with file name: /boot/grub/menu.lst: Expected 'grub' but got ''
function RunTheTest[38]..Test_filetype_detection[2]..CheckItems line 9: with file name: /boot/grub/grub.conf: Expected 'grub' but got ''
TEST FAILURE


# emerge -pqv '=app-editors/vim-8.1.0034::gentoo'
[ebuild     U ] app-editors/vim-8.1.0034 [8.0.1699] USE="X acl -cscope -debug -gpm -lua -luajit -minimal -nls -perl -python -racket -ruby (-selinux) -tcl -terminal -vim-pager" PYTHON_SINGLE_TARGET="python3_5 -python2_7 -python3_4 -python3_6" PYTHON_TARGETS="python2_7 python3_5 -python3_4 -python3_6"