Gentoo Websites Logo
Go to: Gentoo Home Documentation Forums Lists Bugs Planet Store Wiki Get Gentoo!
Bug 640102 - app-misc/boxes-1.1.2-r3 : [TEST] make: *** [Makefile:<snip>: test] Error 1
Summary: app-misc/boxes-1.1.2-r3 : [TEST] make: *** [Makefile:<snip>: test] Error 1
Status: CONFIRMED
Alias: None
Product: Gentoo Linux
Classification: Unclassified
Component: Current packages (show other bugs)
Hardware: All Linux
: Normal normal (vote)
Assignee: Gentoo Shell Tools Herd Bugs
URL:
Whiteboard:
Keywords: TESTFAILURE
Depends on:
Blocks:
 
Reported: 2017-12-06 19:02 UTC by Toralf Förster
Modified: 2018-05-25 19:50 UTC (History)
0 users

See Also:
Package list:
Runtime testing required: ---


Attachments
emerge-info.txt (emerge-info.txt,16.58 KB, text/plain)
2017-12-06 19:02 UTC, Toralf Förster
Details
app-misc:boxes-1.1.2-r3:20171206-095131.log (app-misc:boxes-1.1.2-r3:20171206-095131.log,46.47 KB, text/plain)
2017-12-06 19:02 UTC, Toralf Förster
Details
emerge-history.txt (emerge-history.txt,200.74 KB, text/plain)
2017-12-06 19:02 UTC, Toralf Förster
Details
environment (environment,87.69 KB, text/plain)
2017-12-06 19:02 UTC, Toralf Förster
Details
etc.portage.tbz2 (etc.portage.tbz2,14.47 KB, application/x-bzip)
2017-12-06 19:02 UTC, Toralf Förster
Details
temp.tbz2 (temp.tbz2,26.75 KB, application/x-bzip)
2017-12-06 19:03 UTC, Toralf Förster
Details
emerge-info.txt (emerge-info.txt,18.11 KB, text/plain)
2018-05-25 19:50 UTC, Toralf Förster
Details
app-misc:boxes-1.1.2-r3:20180525-194105.log (app-misc:boxes-1.1.2-r3:20180525-194105.log,45.26 KB, text/plain)
2018-05-25 19:50 UTC, Toralf Förster
Details
emerge-history.txt (emerge-history.txt,384.08 KB, text/plain)
2018-05-25 19:50 UTC, Toralf Förster
Details
environment (environment,88.08 KB, text/plain)
2018-05-25 19:50 UTC, Toralf Förster
Details
etc.portage.tbz2 (etc.portage.tbz2,25.02 KB, application/x-bzip)
2018-05-25 19:50 UTC, Toralf Förster
Details
temp.tbz2 (temp.tbz2,26.31 KB, application/x-bzip)
2018-05-25 19:50 UTC, Toralf Förster
Details

Note You need to log in before you can comment on or make changes to this bug.
Description Toralf Förster gentoo-dev 2017-12-06 19:02:42 UTC
    OK
84 tests executed, 8 successful, 76 failed.
make: *** [Makefile:81: test] Error 1
 * ERROR: app-misc/boxes-1.1.2-r3::gentoo failed (test phase):
 *   Make test failed. See above for details.
 * 

  -------------------------------------------------------------------

  This is an unstable amd64 chroot image at a tinderbox (==build bot)
  name: 17.0-desktop-plasma-systemd_libressl-test_20171129-194156

  -------------------------------------------------------------------

gcc-config -l:
 [1] x86_64-pc-linux-gnu-7.2.0 *

Available Python interpreters, in order of preference:
  [1]   python3.4
  [2]   python3.6 (fallback)
  [3]   python3.5 (fallback)
  [4]   python2.7 (fallback)
  [5]   pypy (fallback)

java-config:
The following VMs are available for generation-2:
*)	IcedTea JDK 3.6.0 [icedtea-bin-8]
Available Java Virtual Machines:
  [1]   icedtea-bin-8  system-vm

emerge -qpv app-misc/boxes
[ebuild  N    ] app-misc/boxes-1.1.2-r3
Comment 1 Toralf Förster gentoo-dev 2017-12-06 19:02:45 UTC
Created attachment 508534 [details]
emerge-info.txt
Comment 2 Toralf Förster gentoo-dev 2017-12-06 19:02:48 UTC
Created attachment 508536 [details]
app-misc:boxes-1.1.2-r3:20171206-095131.log
Comment 3 Toralf Förster gentoo-dev 2017-12-06 19:02:51 UTC
Created attachment 508538 [details]
emerge-history.txt
Comment 4 Toralf Förster gentoo-dev 2017-12-06 19:02:55 UTC
Created attachment 508540 [details]
environment
Comment 5 Toralf Förster gentoo-dev 2017-12-06 19:02:58 UTC
Created attachment 508542 [details]
etc.portage.tbz2
Comment 6 Toralf Förster gentoo-dev 2017-12-06 19:03:01 UTC
Created attachment 508544 [details]
temp.tbz2
Comment 7 Patrice Clement gentoo-dev 2017-12-14 21:39:29 UTC
Really weird. The binary produced by your system is really broken as it just segfaults for all test cases. Could you please downgrade the GCC version to 6.4.0 and give it another try?
Comment 8 Toralf Förster gentoo-dev 2017-12-14 22:32:41 UTC
(In reply to Patrice Clement from comment #7)
too much hassle for that image - we might close this bug till it can be reproduced
Comment 9 Toralf Förster gentoo-dev 2018-05-25 19:50:38 UTC
appeared recently at the tinderbox image 17.0-hardened_test_20180512-194415
Comment 10 Toralf Förster gentoo-dev 2018-05-25 19:50:42 UTC
Created attachment 533222 [details]
emerge-info.txt
Comment 11 Toralf Förster gentoo-dev 2018-05-25 19:50:45 UTC
Created attachment 533224 [details]
app-misc:boxes-1.1.2-r3:20180525-194105.log
Comment 12 Toralf Förster gentoo-dev 2018-05-25 19:50:49 UTC
Created attachment 533226 [details]
emerge-history.txt
Comment 13 Toralf Förster gentoo-dev 2018-05-25 19:50:53 UTC
Created attachment 533228 [details]
environment
Comment 14 Toralf Förster gentoo-dev 2018-05-25 19:50:56 UTC
Created attachment 533230 [details]
etc.portage.tbz2
Comment 15 Toralf Förster gentoo-dev 2018-05-25 19:50:59 UTC
Created attachment 533232 [details]
temp.tbz2