Gentoo Websites Logo
Go to: Gentoo Home Documentation Forums Lists Bugs Planet Store Wiki Get Gentoo!
Bug 637528 - dev-games/simgear-2020.3.5: test failures
Summary: dev-games/simgear-2020.3.5: test failures
Status: CONFIRMED
Alias: None
Product: Gentoo Linux
Classification: Unclassified
Component: Current packages (show other bugs)
Hardware: All Linux
: Normal normal (vote)
Assignee: Maciej Mrozowski
URL:
Whiteboard:
Keywords: TESTFAILURE
: 603650 631564 (view as bug list)
Depends on:
Blocks: 612964
  Show dependency tree
 
Reported: 2017-11-14 21:30 UTC by Thomas Deutschmann
Modified: 2021-01-24 03:52 UTC (History)
3 users (show)

See Also:
Package list:
Runtime testing required: ---


Attachments
build.log (build.log,464.66 KB, text/plain)
2017-11-14 21:30 UTC, Thomas Deutschmann
Details
LastTest.log (LastTest.log,50.26 KB, text/plain)
2017-11-14 21:31 UTC, Thomas Deutschmann
Details

Note You need to log in before you can comment on or make changes to this bug.
Description Thomas Deutschmann gentoo-dev Security 2017-11-14 21:30:37 UTC
Created attachment 504256 [details]
build.log

73% tests passed, 11 tests failed out of 41

Total Test time (real) =   5.78 sec

The following tests FAILED:
          2 - bvhtest (SEGFAULT)
          3 - http (SEGFAULT)
          5 - binobj (SEGFAULT)
          6 - http_repository (OTHER_FAULT)
         34 - canvas_element-boost_test (SEGFAULT)
         35 - canvas_event-boost_test (SEGFAULT)
         36 - canvas_layout-boost_test (SEGFAULT)
         37 - metar (SEGFAULT)
         38 - parseBlendFunc (SEGFAULT)
         39 - animations (SEGFAULT)
         41 - parse_color (SEGFAULT)
Errors while running CTest
 * ERROR: dev-games/simgear-2017.2.1::gentoo failed (test phase):
 *   Tests failed. When you file a bug, please attach the following file:
 *      /var/tmp/portage/dev-games/simgear-2017.2.1/work/simgear-2017.2.1_build/Testing/Temporary/LastTest.log
 *


Portage 2.3.13 (python 3.4.5-final-0, default/linux/x86/13.0, gcc-5.4.0, glibc-2.25-r9, 4.12.14-gentoo i686)
=================================================================
System uname: Linux-4.12.14-gentoo-i686-Intel-R-_Core-TM-_i7-3770K_CPU_@_3.50GHz-with-gentoo-2.4.1
KiB Mem:     3108084 total,   1198292 free
KiB Swap:     488276 total,    488276 free
Timestamp of repository gentoo: Tue, 14 Nov 2017 20:04:06 +0000
Head commit of repository gentoo: eb6bec47ec0d459af0c12f5195e3398a46461ac5

sh bash 4.3_p48-r1
ld GNU ld (Gentoo 2.28.1 p1.0) 2.28.1
app-shells/bash:          4.3_p48-r1::gentoo
dev-lang/perl:            5.24.3::gentoo
dev-lang/python:          2.7.14::gentoo, 3.4.5::gentoo, 3.5.4::gentoo
dev-util/cmake:           3.8.2::gentoo
dev-util/pkgconfig:       0.29.2::gentoo
sys-apps/baselayout:      2.4.1-r2::gentoo
sys-apps/openrc:          0.34.7::gentoo
sys-apps/sandbox:         2.10-r4::gentoo
sys-devel/autoconf:       2.13::gentoo, 2.69::gentoo
sys-devel/automake:       1.15.1-r1::gentoo
sys-devel/binutils:       2.28.1::gentoo
sys-devel/gcc:            5.4.0-r3::gentoo
sys-devel/gcc-config:     1.8-r1::gentoo
sys-devel/libtool:        2.4.6-r3::gentoo
sys-devel/make:           4.2.1::gentoo
sys-kernel/linux-headers: 4.4::gentoo (virtual/os-headers)
sys-libs/glibc:           2.25-r9::gentoo
Repositories:

gentoo
    location: /usr/portage
    sync-type: git
    sync-uri: https://github.com/gentoo-mirror/gentoo.git
    priority: -1000

ABI="x86"
ABI_X86="32"
ACCEPT_KEYWORDS="x86"
ACCEPT_LICENSE="* -@EULA"
ACCEPT_PROPERTIES="*"
ACCEPT_RESTRICT="*"
ARCH="x86"
CBUILD="i686-pc-linux-gnu"
CFLAGS="-O2 -pipe -march=pentium4m -mtune=pentium4m"
CHOST="i686-pc-linux-gnu"
CHOST_x86="i686-pc-linux-gnu"
COLLISION_IGNORE="/lib/modules/* *.py[co] *$py.class */dropin.cache"
CONFIG_PROTECT="/etc"
CPU_FLAGS_X86="mmx mmxext sse sse2"
CXXFLAGS="-O2 -pipe -march=pentium4m -mtune=pentium4m"
DEFAULT_ABI="x86"
EDITOR="/usr/bin/mcedit"
ELIBC="glibc"
EPREFIX=""
EROOT="/"
FCFLAGS="-O2 -march=i686 -pipe"
FEATURES="assume-digests binpkg-logs cgroup config-protect-if-modified distlocks downgrade-backup ebuild-locks fixlafiles merge-sync multilib-strict news parallel-fetch preserve-libs protect-owned sandbox sfperms strict unknown-features-warn unmerge-logs unmerge-orphans userfetch userpriv usersandbox usersync xattr"
FFLAGS="-O2 -march=i686 -pipe"
GCC_SPECS=""
GRUB_PLATFORMS="efi-32 pc"
GSETTINGS_BACKEND="dconf"
HOME="/root"
INFOPATH="/usr/share/gcc-data/i686-pc-linux-gnu/5.4.0/info:/usr/share/binutils-data/i686-pc-linux-gnu/2.28.1/info:/usr/share/info"
INPUT_DEVICES="libinput keyboard mouse"
IUSE_IMPLICIT="abi_x86_32 prefix prefix-chain prefix-guest"
KERNEL="linux"
L10N="en en-US de de-DE"
LANG="en_US.UTF-8"
LC_ALL="en_US.UTF-8"
LC_MESSAGES="C"
LC_PAPER="de_DE.UTF-8"
LDFLAGS="-Wl,-O1 -Wl,--as-needed"
LIBDIR_x86="lib"
LINGUAS="en de"
LOGNAME="root"
MAIL="/var/mail/root"
MAKEOPTS="--jobs 5 --load-average 7.95"
MULTILIB_ABIS="x86"
NOCOLOR="true"
OFFICE_IMPLEMENTATION="libreoffice"
OPENGL_PROFILE="xorg-x11"
PAGER="/usr/bin/less"
PATH="/usr/i686-pc-linux-gnu/gcc-bin/5.4.0:/usr/local/sbin:/usr/local/bin:/usr/sbin:/usr/bin:/sbin:/bin:/opt/bin"
PHP_TARGETS="php5-6 php7-0"
POSTGRES_TARGETS="postgres9_5"
PWD="/root"
PYTHONDONTWRITEBYTECODE="1"
PYTHON_SINGLE_TARGET="python3_4"
PYTHON_TARGETS="python2_7 python3_4 python3_5"
QT_GRAPHICSSYSTEM="raster"
ROOT="/"
ROOTPATH="/usr/i686-pc-linux-gnu/gcc-bin/5.4.0:/usr/local/sbin:/usr/local/bin:/usr/sbin:/usr/bin:/sbin:/bin:/opt/bin"
RUBY_TARGETS="ruby22"
SHELL="/bin/bash"
SHLVL="2"
SSH_TTY="/dev/pts/0"
TERM="screen"
TMUX="/tmp/tmux-0/default,4891,0"
TMUX_PANE="%3"
TWISTED_DISABLE_WRITING_OF_PLUGIN_CACHE="1"
USER="root"
USERLAND="GNU"
VIDEO_CARDS="vmware"
Comment 1 Thomas Deutschmann gentoo-dev Security 2017-11-14 21:31:35 UTC
Created attachment 504258 [details]
LastTest.log
Comment 2 Maciej Mrozowski gentoo-dev 2020-02-09 01:40:48 UTC
*** Bug 603650 has been marked as a duplicate of this bug. ***
Comment 3 Maciej Mrozowski gentoo-dev 2020-02-09 01:41:30 UTC
*** Bug 631564 has been marked as a duplicate of this bug. ***
Comment 4 Maciej Mrozowski gentoo-dev 2021-01-24 01:38:44 UTC
Status as of 2020.3.5:


The following tests FAILED:
          6 - dns (Failed)
          8 - http_repository (Child aborted)
         39 - catalog_test (Failed)