Gentoo Websites Logo
Go to: Gentoo Home Documentation Forums Lists Bugs Planet Store Wiki Get Gentoo!
Bug 636316 - dev-python/numpy-1.10.4: test failures (test_argmin_unicode, test_kind.TestKind.test_all)
Summary: dev-python/numpy-1.10.4: test failures (test_argmin_unicode, test_kind.TestKi...
Status: UNCONFIRMED
Alias: None
Product: Gentoo Linux
Classification: Unclassified
Component: Current packages (show other bugs)
Hardware: All Linux
: Normal normal (vote)
Assignee: Gentoo Science Related Packages
URL:
Whiteboard:
Keywords:
Depends on:
Blocks:
 
Reported: 2017-11-02 20:23 UTC by Rolf Eike Beer
Modified: 2018-03-05 06:27 UTC (History)
2 users (show)

See Also:
Package list:
Runtime testing required: ---


Attachments
build.log (build.log.xz,66.36 KB, application/x-xz)
2017-11-02 20:24 UTC, Rolf Eike Beer
Details

Note You need to log in before you can comment on or make changes to this bug.
Description Rolf Eike Beer 2017-11-02 20:23:11 UTC
Portage 2.3.8 (python 2.7.14-final-0, default/linux/sparc/13.0, gcc-5.4.0, glibc-2.25-r8, 4.13.8 sparc64)
=================================================================
                         System Settings
=================================================================
System uname: Linux-4.13.8-sparc64-sun4v-with-gentoo-2.3
KiB Mem:    33133648 total,  17970352 free
KiB Swap:          0 total,         0 free
Timestamp of repository gentoo: Thu, 02 Nov 2017 01:15:01 +0000
Head commit of repository gentoo: 67e214453823f189c1f835335bb3f50eff6ccccc
sh bash 4.3_p48-r1
ld GNU ld (Gentoo 2.28.1 p1.0) 2.28.1
app-shells/bash:          4.3_p48-r1::gentoo
dev-lang/perl:            5.24.3::gentoo
dev-lang/python:          2.7.14::gentoo, 3.4.5::gentoo
dev-util/cmake:           3.8.2::gentoo
dev-util/pkgconfig:       0.29.2::gentoo
sys-apps/baselayout:      2.3::gentoo
sys-apps/openrc:          0.32.1::gentoo
sys-apps/sandbox:         2.10-r4::gentoo
sys-devel/autoconf:       2.69::gentoo
sys-devel/automake:       1.11.6-r1::gentoo, 1.14.1::gentoo, 1.15-r2::gentoo
sys-devel/binutils:       2.28.1::gentoo
sys-devel/gcc:            5.4.0-r3::gentoo
sys-devel/gcc-config:     1.8-r1::gentoo
sys-devel/libtool:        2.4.6-r3::gentoo
sys-devel/make:           4.2.1::gentoo
sys-kernel/linux-headers: 4.4::gentoo (virtual/os-headers)
sys-libs/glibc:           2.25-r8::gentoo
Repositories:

gentoo
    location: /usr/portage
    sync-type: rsync
    sync-uri: rsync://rsync.gentoo.org/gentoo-portage
    priority: -1000

ACCEPT_KEYWORDS="sparc"
ACCEPT_LICENSE="* -@EULA"
CBUILD="sparc-unknown-linux-gnu"
CFLAGS="-O2 -mcpu=niagara2 -pipe"
CHOST="sparc-unknown-linux-gnu"
CONFIG_PROTECT="/etc /usr/share/gnupg/qualified.txt /var/spool/torque"
CONFIG_PROTECT_MASK="/etc/ca-certificates.conf /etc/dconf /etc/env.d /etc/fonts/fonts.conf /etc/gconf /etc/gentoo-release /etc/php/apache2-php5.6/ext-active/ /etc/php/apache2-php7.0/ext-active/ /etc/php/cgi-php5.6/ext-active/ /etc/php/cgi-php7.0/ext-active/ /etc/php/cli-php5.6/ext-active/ /etc/php/cli-php7.0/ext-active/ /etc/revdep-rebuild /etc/sandbox.d /etc/terminfo"
CXXFLAGS="-O2 -mcpu=niagara2 -pipe"
DISTDIR="/usr/portage/distfiles"
FCFLAGS=""
FEATURES="assume-digests binpkg-logs config-protect-if-modified distlocks ebuild-locks fixlafiles merge-sync news parallel-fetch preserve-libs protect-owned sandbox sfperms strict unknown-features-warn unmerge-logs unmerge-orphans userfetch userpriv usersandbox usersync xattr"
FFLAGS=""
GENTOO_MIRRORS="ftp://ftp.wh2.tu-dresden.de/pub/mirrors/gentoo ftp://ftp.join.uni-muenster.de/pub/linux/distributions/gentoo"
LANG="en_US.UTF-8"
LDFLAGS="-Wl,-O1 -Wl,--as-needed"
MAKEOPTS="-j20"
PKGDIR="/usr/portage/packages"
PORTAGE_CONFIGROOT="/"
PORTAGE_RSYNC_OPTS="--recursive --links --safe-links --perms --times --omit-dir-times --compress --force --whole-file --delete --stats --human-readable --timeout=180 --exclude=/distfiles --exclude=/local --exclude=/packages --exclude=/.git"
PORTAGE_TMPDIR="/var/tmp"
USE="acl berkdb big-endian bzip2 cli cracklib crypt cxx dri fortran gdbm iconv ipv6 modules ncurses nls nptl openmp pam pcre readline session sparc ssl tcpd unicode xattr zlib" APACHE2_MODULES="authn_core authz_core socache_shmcb unixd actions alias auth_basic authn_alias authn_anon authn_dbm authn_default authn_file authz_dbm authz_default authz_groupfile authz_host authz_owner authz_user autoindex cache cgi cgid dav dav_fs dav_lock deflate dir disk_cache env expires ext_filter file_cache filter headers include info log_config logio mem_cache mime mime_magic negotiation rewrite setenvif speling status unique_id userdir usertrack vhost_alias" CALLIGRA_FEATURES="kexi words flow plan sheets stage tables krita karbon braindump author" COLLECTD_PLUGINS="df interface irq load memory rrdtool swap syslog" ELIBC="glibc" GPSD_PROTOCOLS="ashtech aivdm earthmate evermore fv18 garmin garmintxt gpsclock isync itrax mtk3301 nmea ntrip navcom oceanserver oldstyle oncore rtcm104v2 rtcm104v3 sirf skytraq superstar2 timing tsip tripmate tnt ublox ubx" INPUT_DEVICES="libinput keyboard mouse" KERNEL="linux" LCD_DEVICES="bayrad cfontz cfontz633 glk hd44780 lb216 lcdm001 mtxorb ncurses text" LIBREOFFICE_EXTENSIONS="presenter-console presenter-minimizer" OFFICE_IMPLEMENTATION="libreoffice" PHP_TARGETS="php5-6" POSTGRES_TARGETS="postgres9_5" PYTHON_SINGLE_TARGET="python3_4" PYTHON_TARGETS="python2_7 python3_4" RUBY_TARGETS="ruby21 ruby22" USERLAND="GNU" VIDEO_CARDS="fbdev glint mach64 mga r128 radeon sunbw2 suncg14 suncg3 suncg6 sunffb sunleo tdfx dummy v4l" XTABLES_ADDONS="quota2 psd pknock lscan length2 ipv4options ipset ipp2p iface geoip fuzzy condition tee tarpit sysrq steal rawnat logmark ipmark dhcpmac delude chaos account"
Unset:  CC, CPPFLAGS, CTARGET, CXX, EMERGE_DEFAULT_OPTS, INSTALL_MASK, LC_ALL, PORTAGE_BUNZIP2_COMMAND, PORTAGE_COMPRESS, PORTAGE_COMPRESS_FLAGS, PORTAGE_RSYNC_EXTRA_OPTS

=================================================================
                        Package Settings
=================================================================

dev-python/numpy-1.10.4::gentoo was built with the following:
USE="doc lapack -test" PYTHON_TARGETS="python2_7 python3_4 -python3_5 -python3_6"
CFLAGS="-O2 -mcpu=niagara2 -pipe -fno-strict-aliasing"
CXXFLAGS="-O2 -mcpu=niagara2 -pipe -fno-strict-aliasing"
LDFLAGS="-Wl,-O1 -Wl,--as-needed -shared"


Reproducible: Always
Comment 1 Rolf Eike Beer 2017-11-02 20:24:20 UTC
Created attachment 501948 [details]
build.log
Comment 2 Rolf Eike Beer 2017-12-05 20:22:53 UTC
Not a regression, is the same with 1.9.2:

======================================================================
FAIL: test_argmin_unicode (test_multiarray.TestArgmin)
----------------------------------------------------------------------
Traceback (most recent call last):
  File "/var/tmp/portage/dev-python/numpy-1.9.2/work/numpy-1.9.2-python2_7/build/test/lib/numpy/core/tests/test_multiarray.py", line 2460, in test_argmin_unicode
    assert_equal(d.argmin(), 6001)
  File "/var/tmp/portage/dev-python/numpy-1.9.2/work/numpy-1.9.2-python2_7/build/test/lib/numpy/testing/utils.py", line 334, in assert_equal
    raise AssertionError(msg)
AssertionError:
Items are not equal:
 ACTUAL: 0
 DESIRED: 6001

======================================================================
FAIL: test_kind.TestKind.test_all
----------------------------------------------------------------------
Traceback (most recent call last):
  File "/usr/lib/python2.7/site-packages/nose/case.py", line 197, in runTest
    self.test(*self.arg)
  File "/var/tmp/portage/dev-python/numpy-1.9.2/work/numpy-1.9.2-python2_7/build/test/lib/numpy/f2py/tests/test_kind.py", line 32, in test_all
    'selectedrealkind(%s): expected %r but got %r' %  (i, selected_real_kind(i), selectedrealkind(i)))
  File "/var/tmp/portage/dev-python/numpy-1.9.2/work/numpy-1.9.2-python2_7/build/test/lib/numpy/testing/utils.py", line 53, in assert_
    raise AssertionError(smsg)
AssertionError: selectedrealkind(16): expected 10 but got 16

----------------------------------------------------------------------
Ran 5721 tests in 945.584s

FAILED (KNOWNFAIL=5, SKIP=12, failures=2)
Running unit tests for numpy
NumPy version 1.9.2
NumPy is installed in /var/tmp/portage/dev-python/numpy-1.9.2/work/numpy-1.9.2-python2_7/build/test/lib/numpy
Python version 2.7.14 (default, Nov 28 2017, 11:04:37) [GCC 6.4.0]
nose version 1.3.7
Comment 3 Mart Raudsepp gentoo-dev 2018-03-05 03:02:58 UTC
same issue on arm64