Gentoo Websites Logo
Go to: Gentoo Home Documentation Forums Lists Bugs Planet Store Wiki Get Gentoo!
Bug 635322 - dev-libs/cereal-1.2.2 : /.../stubs.h:7:27: fatal error: gnu/stubs-32.h: No such file or directory
Summary: dev-libs/cereal-1.2.2 : /.../stubs.h:7:27: fatal error: gnu/stubs-32.h: No su...
Status: CONFIRMED
Alias: None
Product: Gentoo Linux
Classification: Unclassified
Component: Current packages (show other bugs)
Hardware: All Linux
: Normal normal (vote)
Assignee: No maintainer - Look at https://wiki.gentoo.org/wiki/Project:Proxy_Maintainers if you want to take care of it
URL:
Whiteboard:
Keywords: TESTFAILURE
Depends on:
Blocks:
 
Reported: 2017-10-24 16:36 UTC by Toralf Förster
Modified: 2020-06-25 15:13 UTC (History)
0 users

See Also:
Package list:
Runtime testing required: ---


Attachments
emerge-info.txt (emerge-info.txt,15.84 KB, text/plain)
2017-10-24 16:36 UTC, Toralf Förster
Details
dev-libs:cereal-1.2.2:20171024-144645.log (dev-libs:cereal-1.2.2:20171024-144645.log,10.06 KB, text/plain)
2017-10-24 16:36 UTC, Toralf Förster
Details
emerge-history.txt (emerge-history.txt,80.76 KB, text/plain)
2017-10-24 16:36 UTC, Toralf Förster
Details
environment (environment,118.35 KB, text/plain)
2017-10-24 16:36 UTC, Toralf Förster
Details
etc.portage.tbz2 (etc.portage.tbz2,13.82 KB, application/x-bzip)
2017-10-24 16:36 UTC, Toralf Förster
Details
logs.tbz2 (logs.tbz2,4.53 KB, application/x-bzip)
2017-10-24 16:36 UTC, Toralf Förster
Details
temp.tbz2 (temp.tbz2,29.39 KB, application/x-bzip)
2017-10-24 16:36 UTC, Toralf Förster
Details

Note You need to log in before you can comment on or make changes to this bug.
Description Toralf Förster gentoo-dev 2017-10-24 16:36:13 UTC
                 from /var/tmp/portage/dev-libs/cereal-1.2.2/work/cereal-1.2.2/unittests/tuple.hpp:29,
                 from /var/tmp/portage/dev-libs/cereal-1.2.2/work/cereal-1.2.2/unittests/tuple.cpp:28:
/usr/include/gnu/stubs.h:7:27: fatal error: gnu/stubs-32.h: No such file or directory
 # include <gnu/stubs-32.h>
                           ^
compilation terminated.

  -------------------------------------------------------------------

  This is an unstable amd64 chroot image at a tinderbox (==build bot)
  name: 17.0-no-multilib_libressl-test_20171022-133742

  -------------------------------------------------------------------

gcc-config -l:
 [1] x86_64-pc-linux-gnu-6.4.0 *

Available Python interpreters, in order of preference:
  [1]   python3.4
  [2]   python2.7 (fallback)




emerge -qpv dev-libs/cereal
[ebuild  N    ] dev-libs/cereal-1.2.2  USE="{test}"
Comment 1 Toralf Förster gentoo-dev 2017-10-24 16:36:16 UTC
Created attachment 499912 [details]
emerge-info.txt
Comment 2 Toralf Förster gentoo-dev 2017-10-24 16:36:19 UTC
Created attachment 499914 [details]
dev-libs:cereal-1.2.2:20171024-144645.log
Comment 3 Toralf Förster gentoo-dev 2017-10-24 16:36:22 UTC
Created attachment 499916 [details]
emerge-history.txt
Comment 4 Toralf Förster gentoo-dev 2017-10-24 16:36:25 UTC
Created attachment 499918 [details]
environment
Comment 5 Toralf Förster gentoo-dev 2017-10-24 16:36:28 UTC
Created attachment 499920 [details]
etc.portage.tbz2
Comment 6 Toralf Förster gentoo-dev 2017-10-24 16:36:31 UTC
Created attachment 499922 [details]
logs.tbz2
Comment 7 Toralf Förster gentoo-dev 2017-10-24 16:36:34 UTC
Created attachment 499924 [details]
temp.tbz2