Gentoo Websites Logo
Go to: Gentoo Home Documentation Forums Lists Bugs Planet Store Wiki Get Gentoo!
Bug 634130 - dev-scheme/guile-cairo-1.9.91 fails tests
Summary: dev-scheme/guile-cairo-1.9.91 fails tests
Status: CONFIRMED
Alias: None
Product: Gentoo Linux
Classification: Unclassified
Component: Current packages (show other bugs)
Hardware: All Linux
: Normal normal (vote)
Assignee: Scheme Project
URL:
Whiteboard:
Keywords: TESTFAILURE
: 687582 (view as bug list)
Depends on:
Blocks:
 
Reported: 2017-10-12 21:33 UTC by eroen
Modified: 2019-06-10 07:56 UTC (History)
1 user (show)

See Also:
Package list:
Runtime testing required: ---


Attachments
dev-scheme/guile-cairo-1.9.91:20171012-212116.log (guile-cairo-1.9.91:20171012-212116.log,27.11 KB, text/plain)
2017-10-12 21:33 UTC, eroen
Details

Note You need to log in before you can comment on or make changes to this bug.
Description eroen 2017-10-12 21:33:56 UTC
Created attachment 498472 [details]
dev-scheme/guile-cairo-1.9.91:20171012-212116.log

make  check-TESTS
make[4]: Entering directory '/var/tmp/portage/dev-scheme/guile-cairo-1.9.91/work/guile-cairo-1.9.91_build/tests/unit-tests'
;;; note: auto-compilation is enabled, set GUILE_AUTO_COMPILE=0
;;;       or pass the --no-auto-compile argument to disable.
;;; compiling /var/tmp/portage/dev-scheme/guile-cairo-1.9.91/work/guile-cairo-1.9.91/tests/unit-tests/api-stability.scm
;;; compiled /var/tmp/portage/dev-scheme/guile-cairo-1.9.91/homedir/.cache/guile/ccache/2.0-LE-8-2.0/var/tmp/portage/dev-scheme/guile-cairo-1.9.91/work/guile-cairo-1.9.91/tests/unit-tests/api-stability.scm.go

Running test suite: main-suite ----------------------------------------

Running test suite: <test-api>-suite ----------------------------------
Running test case: test-api
;;; compiling /var/tmp/portage/dev-scheme/guile-cairo-1.9.91/work/guile-cairo-1.9.91/cairo.scm
;;; compiling /var/tmp/portage/dev-scheme/guile-cairo-1.9.91/work/guile-cairo-1.9.91_build/cairo/config.scm
;;; compiled /var/tmp/portage/dev-scheme/guile-cairo-1.9.91/homedir/.cache/guile/ccache/2.0-LE-8-2.0/var/tmp/portage/dev-scheme/guile-cairo-1.9.91/work/guile-cairo-1.9.91_build/cairo/config.scm.go
;;; compiling /var/tmp/portage/dev-scheme/guile-cairo-1.9.91/work/guile-cairo-1.9.91/cairo/vector-types.scm
;;; compiled /var/tmp/portage/dev-scheme/guile-cairo-1.9.91/homedir/.cache/guile/ccache/2.0-LE-8-2.0/var/tmp/portage/dev-scheme/guile-cairo-1.9.91/work/guile-cairo-1.9.91/cairo/vector-types.scm.go
;;; compiled /var/tmp/portage/dev-scheme/guile-cairo-1.9.91/homedir/.cache/guile/ccache/2.0-LE-8-2.0/var/tmp/portage/dev-scheme/guile-cairo-1.9.91/work/guile-cairo-1.9.91/cairo.scm.go
test-api: exception in test: (misc-error "dynamic-link" "file: ~S, message: ~S" ("/var/tmp/portage/dev-scheme/guile-cairo-1.9.91/work/guile-cairo-1.9.91_build/guile-cairo/libguile-cairo" "file not found") #f)

1 run, 1 failed
FAIL: api-stability.scm
;;; note: auto-compilation is enabled, set GUILE_AUTO_COMPILE=0
;;;       or pass the --no-auto-compile argument to disable.
;;; compiling /var/tmp/portage/dev-scheme/guile-cairo-1.9.91/work/guile-cairo-1.9.91/tests/unit-tests/version.scm
;;; WARNING: compilation of /var/tmp/portage/dev-scheme/guile-cairo-1.9.91/work/guile-cairo-1.9.91/tests/unit-tests/version.scm failed:
;;; ERROR: In procedure dynamic-link: file: "/var/tmp/portage/dev-scheme/guile-cairo-1.9.91/work/guile-cairo-1.9.91_build/guile-cairo/libguile-cairo", message: "file not found"

Running test suite: main-suite ----------------------------------------

Running test suite: <test-version>-suite ------------------------------
Running test case: test-version
test-version: exception in test: (unbound-variable #f "Unbound variable: ~S" (cairo-version) #f)

1 run, 1 failed
FAIL: version.scm
===================
2 of 2 tests failed
===================
make[4]: *** [Makefile:247: check-TESTS] Error 1
make[4]: Leaving directory '/var/tmp/portage/dev-scheme/guile-cairo-1.9.91/work/guile-cairo-1.9.91_build/tests/unit-tests'
make[3]: *** [Makefile:369: check-am] Error 2
make[3]: Leaving directory '/var/tmp/portage/dev-scheme/guile-cairo-1.9.91/work/guile-cairo-1.9.91_build/tests/unit-tests'
make[2]: *** [Makefile:278: check-recursive] Error 1
make[2]: Leaving directory '/var/tmp/portage/dev-scheme/guile-cairo-1.9.91/work/guile-cairo-1.9.91_build/tests'
make[1]: *** [Makefile:395: check-recursive] Error 1
make[1]: Leaving directory '/var/tmp/portage/dev-scheme/guile-cairo-1.9.91/work/guile-cairo-1.9.91_build'
make: *** [Makefile:703: check] Error 2
 * ERROR: dev-scheme/guile-cairo-1.9.91::gentoo failed (test phase):
 *   emake failed
Comment 1 eroen 2017-10-12 21:35:29 UTC
occam ~ # emerge --info '=dev-scheme/guile-cairo-1.9.91::gentoo'
Portage 2.3.7 (python 3.6.1-final-0, hardened/linux/amd64, gcc-6.4.0, glibc-2.25-r4, 4.12.12-gentoo-o0 x86_64)
=================================================================
                         System Settings
=================================================================
System uname: Linux-4.12.12-gentoo-o0-x86_64-Intel-R-_Core-TM-_i5-2520M_CPU_@_2.50GHz-with-gentoo-2.4.1
KiB Mem:     8006612 total,   3374796 free
KiB Swap:   16777212 total,  14311228 free
Timestamp of repository gentoo: Tue, 10 Oct 2017 07:30:01 +0000
Head commit of repository gentoo: 6711d4f96985b0797c1803cd6f05e5a1410c1018
Timestamp of repository eroen: Sun, 30 Oct 2016 21:58:42 +0000
Head commit of repository sapher: 9ef31d0bf6a902342746fb03a445d4f8b7ddabef

Head commit of repository wiktorb: 722797c27affae074c3d7b0a628cad1bdff2041c

Head commit of repository stuff: d8e0a859abcab76f8da252f1b81507e137968cf2

sh bash 4.4_p12
ld GNU ld (Gentoo 2.27 p1.1) 2.27
ccache version 3.3.4 [disabled]
app-shells/bash:          4.4_p12::gentoo
dev-java/java-config:     2.2.0-r3::gentoo
dev-lang/perl:            5.24.2::gentoo
dev-lang/python:          2.7.13::gentoo, 3.4.6::gentoo, 3.5.3::gentoo, 3.6.1-r1::gentoo
dev-util/ccache:          3.3.4::gentoo
dev-util/cmake:           3.9.1::gentoo
dev-util/pkgconfig:       0.29.2::gentoo
sys-apps/baselayout:      2.4.1-r1::gentoo
sys-apps/openrc:          0.28::gentoo
sys-apps/sandbox:         2.10-r4::gentoo
sys-devel/autoconf:       2.13::gentoo, 2.69-r4::gentoo
sys-devel/automake:       1.9.6-r4::gentoo, 1.15.1::gentoo
sys-devel/binutils:       2.27-r1::gentoo, 2.28.1::gentoo
sys-devel/gcc:            5.3.0::gentoo, 5.4.0-r3::gentoo, 6.3.0::gentoo, 6.4.0::gentoo
sys-devel/gcc-config:     1.8-r1::gentoo
sys-devel/libtool:        2.4.6-r4::gentoo
sys-devel/make:           4.2.1-r1::gentoo
sys-kernel/linux-headers: 4.10::gentoo (virtual/os-headers)
sys-libs/glibc:           2.25-r4::gentoo
Repositories:

gentoo
    location: /usr/portage
    sync-type: rsync
    sync-uri: rsync://rsync.gentoo.org/gentoo-portage
    priority: -1000
    sync-rsync-extra-opts: --exclude ChangeLog* --exclude /metadata/cache/ --stats --delay-updates -c

eroen
    location: /usr/local/portage
    masters: gentoo
    priority: 0

sapher
    location: /var/lib/overlays/sapher
    sync-type: git
    sync-uri: https://github.com/apinsard/sapher-overlay.git
    masters: gentoo

wiktorb
    location: /var/lib/overlays/wiktorb
    sync-type: git
    sync-uri: https://github.com/wiktor-b/overlay.git
    masters: gentoo

enlightenment
    location: /var/lib/layman/enlightenment
    masters: gentoo
    priority: 50

flora
    location: /var/lib/layman/flora
    masters: gentoo
    priority: 50

gamerlay
    location: /var/lib/layman/gamerlay
    masters: gentoo
    priority: 50

glc
    location: /var/lib/layman/glc
    masters: gentoo
    priority: 50

hardened-development
    location: /var/lib/layman/hardened-development
    masters: gentoo
    priority: 50

haskell
    location: /var/lib/layman/haskell
    masters: gentoo
    priority: 50

hasufell
    location: /var/lib/layman/hasufell
    masters: gentoo
    priority: 50

java
    location: /var/lib/layman/java
    masters: gentoo
    priority: 50

laurentb
    location: /var/lib/layman/laurentb
    masters: gentoo
    priority: 50

roslin
    location: /var/lib/layman/roslin
    masters: gentoo
    priority: 50

science
    location: /var/lib/layman/science
    masters: gentoo
    priority: 50

stuff
    location: /var/lib/layman/stuff
    sync-type: git
    sync-uri: https://github.com/istitov/stuff.git
    masters: gentoo
    priority: 50

sunrise
    location: /var/lib/layman/sunrise
    masters: gentoo
    priority: 50

toolchain
    location: /var/lib/layman/toolchain
    masters: gentoo
    priority: 50

v-fox
    location: /var/lib/layman/v-fox
    masters: gentoo
    priority: 50

ACCEPT_KEYWORDS="amd64 ~amd64"
ACCEPT_LICENSE="*"
CBUILD="x86_64-pc-linux-gnu"
CFLAGS="-march=corei7-avx -pipe -Og -g -gdwarf-4"
CHOST="x86_64-pc-linux-gnu"
CONFIG_PROTECT="/etc /usr/share/config /usr/share/easy-rsa /usr/share/gnupg/qualified.txt"
CONFIG_PROTECT_MASK="/etc/ca-certificates.conf /etc/dconf /etc/env.d /etc/fonts/fonts.conf /etc/gconf /etc/gentoo-release /etc/revdep-rebuild /etc/sandbox.d /etc/terminfo /etc/texmf/language.dat.d /etc/texmf/language.def.d /etc/texmf/updmap.d /etc/texmf/web2c"
CXXFLAGS="-march=corei7-avx -pipe -Og -g -gdwarf-4"
DISTDIR="/var/distfiles"
EMERGE_DEFAULT_OPTS="--jobs=4 --autounmask --quiet-build --nospinner --verbose-conflicts --verbose-slot-rebuilds"
FCFLAGS="-O2 -pipe"
FEATURES="assume-digests binpkg-logs binpkg-multi-instance cgroup collision-protect compressdebug config-protect-if-modified distlocks ebuild-locks fixlafiles installsources ipc-sandbox merge-sync multilib-strict network-sandbox news parallel-fetch parallel-install preserve-libs protect-owned sandbox sfperms split-log splitdebug strict test unknown-features-warn unmerge-logs unmerge-orphans userfetch userpriv usersandbox usersync xattr"
FFLAGS="-O2 -pipe"
GENTOO_MIRRORS=""
LANG="en_GB.utf8"
LDFLAGS="-Wl,-O1 -Wl,--as-needed -Wl,--hash-style=gnu"
MAKEOPTS="-j4 -l10"
PKGDIR="/var/packages"
PORTAGE_COMPRESS="xz"
PORTAGE_COMPRESS_FLAGS="-9"
PORTAGE_CONFIGROOT="/"
PORTAGE_RSYNC_EXTRA_OPTS="--exclude ChangeLog* --exclude /metadata/cache/ --stats --delay-updates -c"
PORTAGE_RSYNC_OPTS="--recursive --links --safe-links --perms --times --omit-dir-times --compress --force --whole-file --delete --stats --human-readable --timeout=180 --exclude=/distfiles --exclude=/local --exclude=/packages --exclude=/.git"
PORTAGE_TMPDIR="/var/tmp"
USE="X a52 aac acl alsa amd64 apng audio audiofile avresample avx bash-completion bdf berkdb bluray bzip2 cairo caps cb cdda cdparanoia cdr cjk cli corefonts cracklib crypt cups curl cxx ddate declarative detex device-mapper dga dia djvu dri dts dvd dvi2tty dvipdfm ebook egl exif fam ffmpeg fftw fits flac fontconfig g3dvl gallium gbm gcrypt gdbm gif gimp git glamor glib glibc-omitfp gmp gnuplot gnutls gold gpm graphics graphviz gs gstreamer gtk gtk3 hardened highlight hscolour iconv icu id3tag idn imagemagick imlib inotify iproute2 ipv6 jbig jpeg jpeg2k jpg json justify kde kde4 kpathsea latex lcms libffi libssh2 libv4l luatex lvm lvm2 lzma lzo man metric mikmod mkv mms mmx mng modules mp3 mpeg mpg123 multilib multimedia musepack ncurses netlink nptl nut ocr odbc offensive ogg opengl openmp openvg optimization optimized-qmake opus pam pango pax_kernel pcre pdf pgf phonon pie png postscript private-headers pstricks pth publishers python3 qt3support qt4 raw readline samba sbsms scanner science sdl seccomp session smp sna sndfile speex spell sqlite sse sse2 sse3 sse4 sse41 sse4_1 sse4_2 ssh ssl ssp ssse3 svg t1lib tcpd tesseract theora threads tiff tls truetype udev unicode urandom usb v4l v4l2 vaapi video vorbis vpx webp wmf x264 xanim xattr xcb xcomposite xetex xft xinerama xkb xml xmlpatterns xorg xosd xpm xrandr xtpax xv xvid xvmc xz zlib zsh-completion" ABI_X86="32 64" APACHE2_MODULES="authn_core authz_core socache_shmcb unixd actions alias auth_basic authn_alias authn_anon authn_dbm authn_default authn_file authz_dbm authz_default authz_groupfile authz_host authz_owner authz_user autoindex cache cgi cgid dav dav_fs dav_lock deflate dir disk_cache env expires ext_filter file_cache filter headers include info log_config logio mem_cache mime mime_magic negotiation rewrite setenvif speling status unique_id userdir usertrack vhost_alias" CALLIGRA_FEATURES="kexi words flow plan sheets stage tables krita karbon braindump author" COLLECTD_PLUGINS="df interface irq load memory rrdtool swap syslog" CPU_FLAGS_X86="mmx sse sse2 avx sse3 ssse3 sse4_1 aes avx mmxext popcnt sse3 sse4_1 sse4_2 ssse3" CURL_SSL="openssl" ELIBC="glibc" GPSD_PROTOCOLS="ashtech aivdm earthmate evermore fv18 garmin garmintxt gpsclock isync itrax mtk3301 nmea ntrip navcom oceanserver oldstyle oncore rtcm104v2 rtcm104v3 sirf skytraq superstar2 timing tsip tripmate tnt ublox ubx" GRUB_PLATFORMS="efi-64" INPUT_DEVICES="mouse keyboard evdev synaptics wacom" KERNEL="linux" L10N="en en-US en-GB eng" LCD_DEVICES="bayrad cfontz cfontz633 glk hd44780 lb216 lcdm001 mtxorb ncurses text" LIBREOFFICE_EXTENSIONS="presenter-console presenter-minimizer" LINGUAS="en gb us en_US en_GB eng jbo no nb nn no_NO nb_NO nn_NO nor" LLVM_TARGETS="BPF X86" OFFICE_IMPLEMENTATION="libreoffice" PHP_TARGETS="php5-3" POSTGRES_TARGETS="postgres9_5" PYTHON_SINGLE_TARGET="python3_4" PYTHON_TARGETS="python2_7 python3_4 python3_5 python3_6" QEMU_SOFTMMU_TARGETS="x86_64 i386" RUBY_TARGETS="ruby22" SANE_BACKENDS="plustek" USERLAND="GNU" VIDEO_CARDS="intel i965 ilo" XTABLES_ADDONS="quota2 psd pknock lscan length2 ipv4options ipset ipp2p iface geoip fuzzy condition tee tarpit sysrq steal rawnat logmark ipmark dhcpmac delude chaos account"
Unset:  CC, CPPFLAGS, CTARGET, CXX, INSTALL_MASK, LC_ALL, PORTAGE_BUNZIP2_COMMAND

occam ~ # emerge -pqv '=dev-scheme/guile-cairo-1.9.91::gentoo'
[ebuild  N    ] dev-scheme/guile-cairo-1.9.91  USE="{test} -static-libs"
Comment 2 Cyprien Nicolas (fulax) 2019-06-10 07:56:31 UTC
*** Bug 687582 has been marked as a duplicate of this bug. ***