Gentoo Websites Logo
Go to: Gentoo Home Documentation Forums Lists Bugs Planet Store Wiki Get Gentoo!
Bug 629664 - dev-libs/apr-util-1.6.0 : Programs failed: testall
Summary: dev-libs/apr-util-1.6.0 : Programs failed: testall
Status: CONFIRMED
Alias: None
Product: Gentoo Linux
Classification: Unclassified
Component: Current packages (show other bugs)
Hardware: All Linux
: Normal normal with 1 vote (vote)
Assignee: Lars Wendler (Polynomial-C)
URL:
Whiteboard:
Keywords: TESTFAILURE
Depends on:
Blocks:
 
Reported: 2017-09-02 14:37 UTC by Toralf Förster
Modified: 2018-10-11 20:59 UTC (History)
2 users (show)

See Also:
Package list:
Runtime testing required: ---


Attachments
emerge-info.txt (emerge-info.txt,15.30 KB, text/plain)
2017-09-02 14:37 UTC, Toralf Förster
Details
dev-libs:apr-util-1.6.0:20170902-142604.log (dev-libs:apr-util-1.6.0:20170902-142604.log,181.30 KB, text/plain)
2017-09-02 14:37 UTC, Toralf Förster
Details
emerge-history.txt (emerge-history.txt,70.07 KB, text/plain)
2017-09-02 14:38 UTC, Toralf Förster
Details
environment (environment,103.39 KB, text/plain)
2017-09-02 14:38 UTC, Toralf Förster
Details
etc.portage.tbz2 (etc.portage.tbz2,11.44 KB, application/x-bzip)
2017-09-02 14:38 UTC, Toralf Förster
Details
logs.tbz2 (logs.tbz2,7.77 KB, application/x-bzip)
2017-09-02 14:38 UTC, Toralf Förster
Details
temp.tbz2 (temp.tbz2,31.40 KB, application/x-bzip)
2017-09-02 14:38 UTC, Toralf Förster
Details

Note You need to log in before you can comment on or make changes to this bug.
Description Toralf Förster gentoo-dev 2017-09-02 14:37:53 UTC
===================================================
testdbm        		    3	   1	 33.33%
Programs failed: testall
make[1]: *** [Makefile:60: check] Error 1
make[1]: Leaving directory '/var/tmp/portage/dev-libs/apr-util-1.6.0/work/apr-util-1.6.0/test'
make: *** [Makefile:121: check] Error 2

  -------------------------------------------------------------------

  This is an unstable amd64 chroot image at a tinderbox (==build bot)
  name: 13.0-desktop-plasma-systemd_20170831-193500

  -------------------------------------------------------------------

gcc-config -l:
 [1] x86_64-pc-linux-gnu-6.4.0 *

Available Python interpreters, in order of preference:
  [1]   python3.4
  [2]   python2.7 (fallback)

java-config:
The following VMs are available for generation-2:
*)	IcedTea JDK 3.5.1 [icedtea-bin-8]
Available Java Virtual Machines:
  [1]   icedtea-bin-8  system-vm

emerge -qpv dev-libs/apr-util
[ebuild  N    ] dev-libs/apr-util-1.6.0  USE="berkdb gdbm ldap -doc -libressl -mysql -nss -odbc -openssl -postgres -sqlite -static-libs"
Comment 1 Toralf Förster gentoo-dev 2017-09-02 14:37:56 UTC
Created attachment 491804 [details]
emerge-info.txt
Comment 2 Toralf Förster gentoo-dev 2017-09-02 14:37:59 UTC
Created attachment 491806 [details]
dev-libs:apr-util-1.6.0:20170902-142604.log
Comment 3 Toralf Förster gentoo-dev 2017-09-02 14:38:02 UTC
Created attachment 491808 [details]
emerge-history.txt
Comment 4 Toralf Förster gentoo-dev 2017-09-02 14:38:05 UTC
Created attachment 491810 [details]
environment
Comment 5 Toralf Förster gentoo-dev 2017-09-02 14:38:09 UTC
Created attachment 491812 [details]
etc.portage.tbz2
Comment 6 Toralf Förster gentoo-dev 2017-09-02 14:38:12 UTC
Created attachment 491814 [details]
logs.tbz2
Comment 7 Toralf Förster gentoo-dev 2017-09-02 14:38:15 UTC
Created attachment 491816 [details]
temp.tbz2
Comment 8 tka 2017-10-02 23:40:30 UTC
Same failure here. Happens only with USE=gdbm.
Comment 9 Toralf Förster gentoo-dev 2018-08-23 17:41:14 UTC
The current ~amd64 apr package tests BTW hangs infinitely - had to kill the process and have now "notest" in my env for the tinderbox