Gentoo Websites Logo
Go to: Gentoo Home Documentation Forums Lists Bugs Planet Store Wiki Get Gentoo!
Bug 624614 - net-dns/opendnssec-2.1.10 fails tests: ./test.sqlite: No such file or directory
Summary: net-dns/opendnssec-2.1.10 fails tests: ./test.sqlite: No such file or directory
Status: CONFIRMED
Alias: None
Product: Gentoo Linux
Classification: Unclassified
Component: Current packages (show other bugs)
Hardware: All Linux
: Normal normal (vote)
Assignee: Marc Schiffbauer
URL:
Whiteboard:
Keywords: TESTFAILURE
Depends on:
Blocks:
 
Reported: 2017-07-11 19:51 UTC by Toralf Förster
Modified: 2021-11-28 01:55 UTC (History)
2 users (show)

See Also:
Package list:
Runtime testing required: ---


Attachments
emerge-info.txt (emerge-info.txt,15.75 KB, text/plain)
2017-07-11 19:51 UTC, Toralf Förster
Details
emerge-history.txt (emerge-history.txt,143.10 KB, text/plain)
2017-07-11 19:52 UTC, Toralf Förster
Details
environment (environment,118.01 KB, text/plain)
2017-07-11 19:52 UTC, Toralf Förster
Details
etc.portage.tbz2 (etc.portage.tbz2,23.47 KB, application/x-bzip)
2017-07-11 19:52 UTC, Toralf Förster
Details
logs.tbz2 (logs.tbz2,20.41 KB, application/x-bzip)
2017-07-11 19:52 UTC, Toralf Förster
Details
net-dns:opendnssec-2.0.3:20170711-193331.log (net-dns:opendnssec-2.0.3:20170711-193331.log,262.88 KB, text/plain)
2017-07-11 19:52 UTC, Toralf Förster
Details
temp.tbz2 (temp.tbz2,39.00 KB, application/x-bzip)
2017-07-11 19:52 UTC, Toralf Förster
Details

Note You need to log in before you can comment on or make changes to this bug.
Description Toralf Förster gentoo-dev 2017-07-11 19:51:55 UTC
softhsm --slot 0 --init-token --label softHSM \
	--so-pin 12345678 --pin 123456
env: ‘softhsm’: No such file or directory
make[2]: *** [Makefile:739: token.db] Error 127
make[2]: Leaving directory '/var/tmp/portage/net-dns/opendnssec-2.0.3/work/opendnssec-2.0.3/libhsm/checks'
make[1]: *** [Makefile:464: check-recursive] Error 1

  -------------------------------------------------------------------

  This is an unstable amd64 chroot image at a tinderbox (==build bot)
  name: 13.0-desktop-gnome_abi32+64_20170706-200324

  -------------------------------------------------------------------

gcc-config -l:
 [1] x86_64-pc-linux-gnu-6.3.0 *

Available Python interpreters, in order of preference:
  [1]   python3.4
  [2]   python2.7 (fallback)
  [3]   jython2.7 (fallback)
Available Ruby profiles:
  [1]   ruby21 (with Rubygems) *
  [2]   ruby22 (with Rubygems)
java-config:
The following VMs are available for generation-2:
*)	IcedTea JDK 3.4.0 [icedtea-bin-8]
2)	IcedTea JDK 3.4.0 (x86) [icedtea-bin-8-x86]
Available Java Virtual Machines:
  [1]   icedtea-bin-8  system-vm
  [2]   icedtea-bin-8-x86
Comment 1 Toralf Förster gentoo-dev 2017-07-11 19:51:58 UTC
Created attachment 483318 [details]
emerge-info.txt
Comment 2 Toralf Förster gentoo-dev 2017-07-11 19:52:01 UTC
Created attachment 483320 [details]
emerge-history.txt
Comment 3 Toralf Förster gentoo-dev 2017-07-11 19:52:04 UTC
Created attachment 483322 [details]
environment
Comment 4 Toralf Förster gentoo-dev 2017-07-11 19:52:07 UTC
Created attachment 483324 [details]
etc.portage.tbz2
Comment 5 Toralf Förster gentoo-dev 2017-07-11 19:52:10 UTC
Created attachment 483326 [details]
logs.tbz2
Comment 6 Toralf Förster gentoo-dev 2017-07-11 19:52:13 UTC
Created attachment 483328 [details]
net-dns:opendnssec-2.0.3:20170711-193331.log
Comment 7 Toralf Förster gentoo-dev 2017-07-11 19:52:17 UTC
Created attachment 483330 [details]
temp.tbz2
Comment 8 Kent Fredric (IRC: kent\n) (RETIRED) gentoo-dev 2017-09-08 21:02:50 UTC
This actually affects all versions.
Comment 9 Marc Schiffbauer gentoo-dev 2021-11-28 01:55:01 UTC
ebuild has been improved in this regard with the new version and missing BDEPENDs added for testing. Unfortunately the source also misses files that are required fo testing so tests still fail. Updating summary.