Gentoo Websites Logo
Go to: Gentoo Home Documentation Forums Lists Bugs Planet Store Wiki Get Gentoo!
Bug 621736 - dev-python/yapsy-1.11.223-r1 fails tests with python-3.6
Summary: dev-python/yapsy-1.11.223-r1 fails tests with python-3.6
Status: CONFIRMED
Alias: None
Product: Gentoo Linux
Classification: Unclassified
Component: Current packages (show other bugs)
Hardware: All Linux
: Normal normal (vote)
Assignee: Sergey Popov
URL:
Whiteboard:
Keywords:
Depends on:
Blocks:
 
Reported: 2017-06-14 13:51 UTC by Pacho Ramos
Modified: 2017-06-14 13:51 UTC (History)
1 user (show)

See Also:
Package list:
Runtime testing required: ---


Attachments
build.log.gz (yapsy-1.11.223-r1:20170614-134949.log.gz,9.41 KB, application/gzip)
2017-06-14 13:51 UTC, Pacho Ramos
Details

Note You need to log in before you can comment on or make changes to this bug.
Description Pacho Ramos gentoo-dev 2017-06-14 13:51:47 UTC
Created attachment 476328 [details]
build.log.gz

======================================================================
FAIL: testTwoStepsLoadWithError (test.test_ErrorInPlugin.ErrorTestCase)
----------------------------------------------------------------------
Traceback (most recent call last):
  File "/var/tmp/portage/dev-python/yapsy-1.11.223-r1/work/Yapsy-1.11.223/test/test_ErrorInPlugin.py", line 53, in testTwoStepsLoadWithError
    self.assertEqual(callback_infos[0].error[0],ImportError)
AssertionError: <class 'ModuleNotFoundError'> != <class 'ImportError'>

----------------------------------------------------------------------
Ran 93 tests in 0.151s

FAILED (failures=1)
Test failed: <unittest.runner.TextTestResult run=93 errors=0 failures=1>
error: Test failed: <unittest.runner.TextTestResult run=93 errors=0 failures=1>