Gentoo Websites Logo
Go to: Gentoo Home Documentation Forums Lists Bugs Planet Store Wiki Get Gentoo!
Bugzilla DB migration completed. Please report issues to Infra team via email via infra@gentoo.org or IRC
Bug 621624 - net-fs/samba-4.5.10 fails tests
Summary: net-fs/samba-4.5.10 fails tests
Status: CONFIRMED
Alias: None
Product: Gentoo Linux
Classification: Unclassified
Component: Current packages (show other bugs)
Hardware: All Linux
: Normal normal (vote)
Assignee: Gentoo's SAMBA Team
URL:
Whiteboard:
Keywords: TESTFAILURE
Depends on:
Blocks: CVE-2017-7494
  Show dependency tree
 
Reported: 2017-06-12 18:50 UTC by Markus Meier
Modified: 2017-06-25 19:36 UTC (History)
0 users

See Also:
Package list:
Runtime testing required: ---


Attachments
net-fs:samba-4.5.10:20170609-091151.log (net-fs:samba-4.5.10:20170609-091151.log,462.33 KB, text/x-log)
2017-06-12 18:50 UTC, Markus Meier
Details

Note You need to log in before you can comment on or make changes to this bug.
Description Markus Meier gentoo-dev 2017-06-12 18:50:33 UTC
Created attachment 476204 [details]
net-fs:samba-4.5.10:20170609-091151.log

* Package:    net-fs/samba-4.5.10
 * Repository: gentoo
 * Maintainer: samba@gentoo.org
 * USE:        acl arm cups elibc_glibc fam kernel_linux ldap pam python_targets_python2_7 system-mitkrb5 test userland_GNU winbind
 * FEATURES:   preserve-libs sandbox test userpriv usersandbox

>>> Test phase: net-fs/samba-4.5.10
 * .arm: running multilib-minimal_abi_src_test
'test' finished successfully (0.357s)
Waf: Entering directory `/var/tmp/portage/net-fs/samba-4.5.10/work/samba-4.5.10-.arm/bin'
        Selected system MIT krb5 libraries, Heimdal use is disabled
Waf: Leaving directory `/var/tmp/portage/net-fs/samba-4.5.10/work/samba-4.5.10-.arm/bin'
'build' finished successfully (2m11.349s)
Traceback (most recent call last):
Traceback (most recent call last):
  File "/var/tmp/portage/net-fs/samba-4.5.10/work/samba-4.5.10-.arm/selftest/format-subunit", line 14, in <module>
      File "/var/tmp/portage/net-fs/samba-4.5.10/work/samba-4.5.10-.arm/selftest/filter-subunit", line 27, in <module>
    import subunithelper
  File "/var/tmp/portage/net-fs/samba-4.5.10/work/samba-4.5.10-.arm/selftest/subunithelper.py", line 22, in <module>
import subunithelper
  File "/var/tmp/portage/net-fs/samba-4.5.10/work/samba-4.5.10-.arm/selftest/subunithelper.py", line 22, in <module>
        from samba import subunit
from samba import subunit
  File "bin/python/samba/__init__.py", line 28, in <module>
  File "bin/python/samba/__init__.py", line 28, in <module>
    import samba.param
    ImportErrorimport samba.param
: ImportError/var/tmp/portage/net-fs/samba-4.5.10/work/samba-4.5.10-.arm/bin/shared/private/libserver-role-samba4.so: version `SAMBA_4.2.14' not found (required by /usr/lib/libsamba-hostconfig.so.0)
: /var/tmp/portage/net-fs/samba-4.5.10/work/samba-4.5.10-.arm/bin/shared/private/libserver-role-samba4.so: version `SAMBA_4.2.14' not found (required by /usr/lib/libsamba-hostconfig.so.0)
OPTIONS --configfile=$SMB_CONF_PATH --option='fss:sequence timeout=1' --maximum-runtime=$SELFTEST_MAXTIME --basedir=$SELFTEST_TMPDIR --format=subunit --option=torture:progress=no
skipping ldb.base (Using system LDB, ldbtest not available)
skipping tdb.stress (Using system TDB, tdbtorture not available)
/var/tmp/portage/net-fs/samba-4.5.10/work/samba-4.5.10-.arm/selftest/selftest.pl: PID[21858]: Got SIGPIPE teardown environments.
perl(21858)---pstree(21869)
/var/tmp/portage/net-fs/samba-4.5.10/work/samba-4.5.10-.arm/selftest/selftest.pl: PID[21858]: Exiting...
TOP 10 slowest tests
test: running (/usr/bin/perl /var/tmp/portage/net-fs/samba-4.5.10/work/samba-4.5.10-.arm/selftest/selftest.pl --target=samba3 --prefix=./st --srcdir=/var/tmp/portage/net-fs/samba-4.5.10/work/samba-4.5.10-.arm --exclude=/var/tmp/portage/ne
t-fs/samba-4.5.10/work/samba-4.5.10-.arm/selftest/skip --testlist="/usr/bin/python2.7 /var/tmp/portage/net-fs/samba-4.5.10/work/samba-4.5.10-.arm/selftest/tests.py|" --testlist="/usr/bin/python2.7 /var/tmp/portage/net-fs/samba-4.5.10/work
/samba-4.5.10-.arm/source3/selftest/tests.py|" --testlist="/usr/bin/python2.7 /var/tmp/portage/net-fs/samba-4.5.10/work/samba-4.5.10-.arm/source4/selftest/tests.py|"  --exclude=/var/tmp/portage/net-fs/samba-4.5.10/work/samba-4.5.10-.arm/s
elftest/slow --nss_wrapper_so_path=libnss_wrapper.so --resolv_wrapper_so_path=libresolv_wrapper.so --socket_wrapper_so_path=libsocket_wrapper.so --uid_wrapper_so_path=libuid_wrapper.so --use-dns-faking --socket-wrapper  && touch ./st/st_d
one) | /usr/bin/python2.7 -u /var/tmp/portage/net-fs/samba-4.5.10/work/samba-4.5.10-.arm/selftest/filter-subunit --expected-failures=/var/tmp/portage/net-fs/samba-4.5.10/work/samba-4.5.10-.arm/selftest/knownfail --flapping=/var/tmp/portag
e/net-fs/samba-4.5.10/work/samba-4.5.10-.arm/selftest/flapping | tee ./st/subunit | /usr/bin/python2.7 -u /var/tmp/portage/net-fs/samba-4.5.10/work/samba-4.5.10-.arm/selftest/format-subunit --prefix=./st --immediate
ERROR: test failed with exit code 1
 * ERROR: net-fs/samba-4.5.10::gentoo failed (test phase):
 *   test failed
 * 
 * Call stack:
 *     ebuild.sh, line  115:  Called src_test
 *   environment, line 4535:  Called multilib-minimal_src_test
 *   environment, line 2878:  Called multilib_foreach_abi 'multilib-minimal_abi_src_test'
 *   environment, line 3050:  Called multibuild_foreach_variant '_multilib_multibuild_wrapper' 'multilib-minimal_abi_src_test'
 *   environment, line 2674:  Called _multibuild_run '_multilib_multibuild_wrapper' 'multilib-minimal_abi_src_test'
 *   environment, line 2672:  Called _multilib_multibuild_wrapper 'multilib-minimal_abi_src_test'
 *   environment, line  474:  Called multilib-minimal_abi_src_test
 *   environment, line 2872:  Called multilib_src_test
 *   environment, line 3303:  Called die

Portage 2.3.5 (python 2.7.12-final-0, default/linux/arm/13.0/armv5te/desktop, gcc-5.4.0, glibc-2.23-r3, 3.10.25-gentoo armv5tel)
=================================================================
System uname: Linux-3.10.25-gentoo-armv5tel-Feroceon_88FR131_rev_1_-v5l-with-gentoo-2.3
KiB Mem:      513244 total,     18424 free
KiB Swap:    1535996 total,   1502608 free
Timestamp of repository gentoo: Mon, 12 Jun 2017 18:30:01 +0000
sh bash 4.3_p48-r1
ld GNU ld (Gentoo 2.26.1 p1.0) 2.26.1
distcc 3.2rc1 armv5tel-softfloat-linux-gnueabi [disabled]
ccache version 3.2.4 [disabled]
app-shells/bash:          4.3_p48-r1::gentoo
dev-lang/perl:            5.24.1-r1::gentoo
dev-lang/python:          2.7.12::gentoo, 3.4.5::gentoo
dev-util/ccache:          3.2.4::gentoo
dev-util/cmake:           3.7.2::gentoo
sys-apps/baselayout:      2.3::gentoo
sys-apps/openrc:          0.26.3::gentoo
sys-apps/sandbox:         2.10-r3::gentoo
sys-devel/autoconf:       2.13::gentoo, 2.69::gentoo
sys-devel/automake:       1.4_p6-r2::gentoo, 1.5-r2::gentoo, 1.6.3-r2::gentoo, 1.7.9-r3::gentoo, 1.8.5-r5::gentoo, 1.9.6-r4::gentoo, 1.10.3-r1::gentoo, 1.11.6-r1::gentoo, 1.12.6::gentoo, 1.13.4::gentoo, 1.14.1::gentoo, 1.15-r2::gentoo
sys-devel/binutils:       2.26.1::gentoo
sys-devel/gcc:            4.9.4::gentoo, 5.4.0-r3::gentoo
sys-devel/gcc-config:     1.7.3::gentoo
sys-devel/libtool:        2.4.6-r3::gentoo
sys-devel/make:           4.2.1::gentoo
sys-kernel/linux-headers: 4.4::gentoo (virtual/os-headers)
sys-libs/glibc:           2.23-r3::gentoo
Repositories:

gentoo
    location: /usr/portage
    sync-type: rsync
    sync-uri: rsync://192.168.1.100/gentoo-portage
    priority: -1000

ACCEPT_KEYWORDS="arm"
ACCEPT_LICENSE="* -@EULA"
CBUILD="armv5tel-softfloat-linux-gnueabi"
CFLAGS="-O2 -march=armv5te -pipe"
CHOST="armv5tel-softfloat-linux-gnueabi"
CONFIG_PROTECT="/etc /etc/omega.conf /etc/stunnel/stunnel.conf /usr/share/easy-rsa /usr/share/gnupg/qualified.txt /var/bind /var/vpopmail/etc"
CONFIG_PROTECT_MASK="/etc/ca-certificates.conf /etc/dconf /etc/env.d /etc/fonts/fonts.conf /etc/gconf /etc/gentoo-release /etc/php/apache2-php5.5/ext-active/ /etc/php/apache2-php5.6/ext-active/ /etc/php/apache2-php7.0/ext-active/ /etc/php/cgi-php5.5/ext-active/ /etc/php/cgi-php5.6/ext-active/ /etc/php/cgi-php7.0/ext-active/ /etc/php/cli-php5.5/ext-active/ /etc/php/cli-php5.6/ext-active/ /etc/php/cli-php7.0/ext-active/ /etc/revdep-rebuild /etc/sandbox.d /etc/terminfo /etc/texmf/language.dat.d /etc/texmf/language.def.d /etc/texmf/updmap.d /etc/texmf/web2c"
CXXFLAGS="-O2 -march=armv5te -pipe"
DISTDIR="/mnt/distfiles"
EMERGE_DEFAULT_OPTS="--quiet-build=n --jobs=2 --keep-going --with-bdeps=y --backtrack=3"
FCFLAGS="-O2 -pipe -march=armv5te"
FEATURES="assume-digests binpkg-logs collision-protect config-protect-if-modified distlocks ebuild-locks fixlafiles merge-sync news parallel-fetch preserve-libs protect-owned sandbox sfperms strict test test-fail-continue unknown-features-warn unmerge-logs unmerge-orphans userfetch userpriv usersandbox usersync xattr"
FFLAGS="-O2 -pipe -march=armv5te"
GENTOO_MIRRORS="http://distfiles.gentoo.org"
LANG="en_GB.utf8"
LDFLAGS="-Wl,-O1 -Wl,--as-needed"
MAKEOPTS="-j2"
PKGDIR="/usr/portage/packages"
PORTAGE_CONFIGROOT="/"
PORTAGE_RSYNC_OPTS="--recursive --links --safe-links --perms --times --omit-dir-times --compress --force --whole-file --delete --stats --human-readable --timeout=180 --exclude=/distfiles --exclude=/local --exclude=/packages --exclude=/.git"
PORTAGE_TMPDIR="/var/tmp"
USE="X a52 aac acl acpi alsa apache2 arm berkdb bluetooth branding bzip2 cairo cdda cdr cli consolekit cracklib crypt cups cxx dbus dri dts dvd dvdr emboss encode exif fam firefox flac fortran gdbm gif glamor gpm gtk iconv jpeg kpathsea lcms ldap libnotify mad mng modules mp3 mp4 mpeg ncurses nls nptl ogg opengl openmp pam pango pcre pdf png policykit ppds qt3support qt4 readline sdl seccomp session spell ssl startup-notification svg tcpd test tiff truetype udev udisks unicode upower usb vorbis wxwidgets x264 xattr xcb xml xv xvid zlib" APACHE2_MODULES="authn_core authz_core socache_shmcb unixd actions alias auth_basic authn_alias authn_anon authn_dbm authn_default authn_file authz_dbm authz_default authz_groupfile authz_host authz_owner authz_user autoindex cache cgi cgid dav dav_fs dav_lock deflate dir disk_cache env expires ext_filter file_cache filter headers include info log_config logio mem_cache mime mime_magic negotiation rewrite setenvif speling status unique_id userdir usertrack vhost_alias" CALLIGRA_FEATURES="kexi words flow plan sheets stage tables krita karbon braindump author" COLLECTD_PLUGINS="df interface irq load memory rrdtool swap syslog" CPU_FLAGS_ARM="edsp thumb v4 v5" ELIBC="glibc" GPSD_PROTOCOLS="ashtech aivdm earthmate evermore fv18 garmin garmintxt gpsclock isync itrax mtk3301 nmea ntrip navcom oceanserver oldstyle oncore rtcm104v2 rtcm104v3 sirf skytraq superstar2 timing tsip tripmate tnt ublox ubx" INPUT_DEVICES="libinput keyboard mouse" KERNEL="linux" LCD_DEVICES="bayrad cfontz cfontz633 glk hd44780 lb216 lcdm001 mtxorb ncurses text" LIBREOFFICE_EXTENSIONS="presenter-console presenter-minimizer" OFFICE_IMPLEMENTATION="libreoffice" PHP_TARGETS="php5-6" PYTHON_SINGLE_TARGET="python3_4" PYTHON_TARGETS="python2_7 python3_4" RUBY_TARGETS="ruby21 ruby22" USERLAND="GNU" VIDEO_CARDS="exynos freedreno omap" XTABLES_ADDONS="quota2 psd pknock lscan length2 ipv4options ipset ipp2p iface geoip fuzzy condition tee tarpit sysrq steal rawnat logmark ipmark dhcpmac delude chaos account"
Unset:  CC, CPPFLAGS, CTARGET, CXX, INSTALL_MASK, LC_ALL, PORTAGE_BUNZIP2_COMMAND, PORTAGE_COMPRESS, PORTAGE_COMPRESS_FLAGS, PORTAGE_RSYNC_EXTRA_OPTS, USE_PYTHON