Gentoo Websites Logo
Go to: Gentoo Home Documentation Forums Lists Bugs Planet Store Wiki Get Gentoo!
Bug 617840 - dev-python/pyflakes-1.2.3 fails test_invalidEscape test with dev-python/pypy3-5.7.1-r1
Summary: dev-python/pyflakes-1.2.3 fails test_invalidEscape test with dev-python/pypy3...
Status: UNCONFIRMED
Alias: None
Product: Gentoo Linux
Classification: Unclassified
Component: Current packages (show other bugs)
Hardware: All Linux
: Normal normal (vote)
Assignee: Python Gentoo Team
URL:
Whiteboard:
Keywords: TESTFAILURE
Depends on:
Blocks:
 
Reported: 2017-05-08 12:38 UTC by Paolo Pedroni
Modified: 2018-06-17 07:50 UTC (History)
2 users (show)

See Also:
Package list:
Runtime testing required: ---


Attachments
pyflakes-1.2.3:20170508-120100.log.gz (pyflakes-1.2.3:20170508-120100.log.gz,11.73 KB, application/gzip)
2017-05-08 12:38 UTC, Paolo Pedroni
Details

Note You need to log in before you can comment on or make changes to this bug.
Description Paolo Pedroni 2017-05-08 12:38:01 UTC
Created attachment 471954 [details]
pyflakes-1.2.3:20170508-120100.log.gz

With dev-python/pypy3-5.5.0_alpha it used to work:

 * pypy3: running distutils-r1_run_phase python_test
/usr/bin/pypy3 setup.py test --quiet
running test
running egg_info
writing pyflakes.egg-info/PKG-INFO
writing dependency_links to pyflakes.egg-info/dependency_links.txt
writing entry points to pyflakes.egg-info/entry_points.txt
writing top-level names to pyflakes.egg-info/top_level.txt
reading manifest file 'pyflakes.egg-info/SOURCES.txt'
reading manifest template 'MANIFEST.in'
writing manifest file 'pyflakes.egg-info/SOURCES.txt'
running build_ext
......F..................................................................s..........ss..s.........s.s..................s...s.............s...............................s.................................................................s..............................s...s.............s...............................s...................................................s................s......s...........................................s..........ss..s.........s.s.sss....s.......s................................s................s......s...............s...s..................s......s....................
======================================================================
FAIL: test_invalidEscape (pyflakes.test.test_api.CheckTests)
----------------------------------------------------------------------
Traceback (most recent call last):
  File "/var/tmp/portage/dev-python/pyflakes-1.5.0/work/pyflakes-1.5.0/pyflakes/test/test_api.py", line 513, in test_invalidEscape
    sourcePath, [decoding_error])
  File "/var/tmp/portage/dev-python/pyflakes-1.5.0/work/pyflakes-1.5.0/pyflakes/test/test_api.py", line 318, in assertHasErrors
    (count, err.getvalue()), (len(errorList), ''.join(errorList)))
AssertionError: Tuples differ: (1, "[60 chars]1:6: (unicode error) 'unicodeescape' codec can[77 chars]^\n") != (1, "[60 chars]1:6: UnicodeDecodeError: ('unicodeescape', b'\[64 chars]^\n")

First differing element 1:
"/var[56 chars]1:6: (unicode error) 'unicodeescape' codec can[76 chars] ^\n"
"/var[56 chars]1:6: UnicodeDecodeError: ('unicodeescape', b'\[63 chars] ^\n"

  (1,
-  '/var/tmp/portage/dev-python/pyflakes-1.5.0/temp/tmpnsegeu6g:1:6: (unicode '
?                                                                    ---------

+  '/var/tmp/portage/dev-python/pyflakes-1.5.0/temp/tmpnsegeu6g:1:6: '
-  "error) 'unicodeescape' codec can't decode bytes in position 0-1: truncated "
-  '\\xXX escape\n'
+  "UnicodeDecodeError: ('unicodeescape', b'\\\\xyz', 0, 2, 'truncated \\\\xXX "
+  "escape')\n"
   "foo = '\\xyz'\n"
   '     ^\n')

----------------------------------------------------------------------
Ran 604 tests in 1.870s

FAILED (failures=1, skipped=36)
Test failed: <unittest.runner.TextTestResult run=604 errors=0 failures=1>
error: Test failed: <unittest.runner.TextTestResult run=604 errors=0 failures=1>

# emerge --info =dev-python/pyflakes-1.2.3
Portage 2.3.5 (python 3.5.3-final-0, default/linux/amd64/13.0/desktop/plasma/systemd, gcc-6.3.0, glibc-2.23-r3, 4.11.0-gentoo x86_64)
=================================================================
                         System Settings
=================================================================
System uname: Linux-4.11.0-gentoo-x86_64-Intel-R-_Core-TM-_i7-2600_CPU_@_3.40GHz-with-gentoo-2.3
KiB Mem:    15864464 total,   3214408 free
KiB Swap:    8171516 total,   8171516 free
Timestamp of repository gentoo: Mon, 08 May 2017 06:45:01 +0000
sh dash 0.5.8.2
ld GNU gold (Gentoo 2.26.1 p1.0 2.26.1) 1.11
distcc 3.2rc1 x86_64-pc-linux-gnu [enabled]
ccache version 3.3.4 [disabled]
app-shells/bash:          4.3_p48-r1::gentoo
dev-java/java-config:     2.2.0-r3::gentoo
dev-lang/perl:            5.24.1-r1::gentoo
dev-lang/python:          2.7.13::gentoo, 3.5.3::gentoo
dev-util/ccache:          3.3.4::gentoo
dev-util/cmake:           3.7.2::gentoo
dev-util/pkgconfig:       0.28-r2::gentoo
sys-apps/baselayout:      2.3::gentoo
sys-apps/sandbox:         2.10-r3::gentoo
sys-devel/autoconf:       2.13::gentoo, 2.69::gentoo
sys-devel/automake:       1.11.6-r1::gentoo, 1.15-r2::gentoo
sys-devel/binutils:       2.26.1::gentoo
sys-devel/gcc:            6.3.0::gentoo
sys-devel/gcc-config:     1.8-r1::gentoo
sys-devel/libtool:        2.4.6-r3::gentoo
sys-devel/make:           4.2.1::gentoo
sys-kernel/linux-headers: 4.10::gentoo (virtual/os-headers)
sys-libs/glibc:           2.23-r3::gentoo
Repositories:

gentoo
    location: /usr/portage
    sync-type: rsync
    sync-uri: rsync://rsync.europe.gentoo.org/gentoo-portage
    priority: -1000

x-portage
    location: /usr/local/portage
    masters: gentoo
    priority: 0

ACCEPT_KEYWORDS="amd64"
ACCEPT_LICENSE="* -@EULA"
CBUILD="x86_64-pc-linux-gnu"
CFLAGS="-O2 -pipe -march=sandybridge -msahf --param l1-cache-size=32 --param l1-cache-line-size=64 --param l2-cache-size=8192 -flto=8 -fuse-linker-plugin -floop-nest-optimize -ftree-loop-distribution -fgraphite-identity -ftree-vectorize"
CHOST="x86_64-pc-linux-gnu"
CONFIG_PROTECT="/etc /usr/lib64/libreoffice/program/sofficerc /usr/share/config /usr/share/gnupg/qualified.txt"
CONFIG_PROTECT_MASK="/etc/ca-certificates.conf /etc/dconf /etc/env.d /etc/fonts/fonts.conf /etc/gconf /etc/gentoo-release /etc/php/apache2-php7.0/ext-active/ /etc/php/cgi-php7.0/ext-active/ /etc/php/cli-php7.0/ext-active/ /etc/revdep-rebuild /etc/sandbox.d /etc/terminfo"
CXXFLAGS="-O2 -pipe -march=sandybridge -msahf --param l1-cache-size=32 --param l1-cache-line-size=64 --param l2-cache-size=8192 -flto=8 -fuse-linker-plugin -floop-nest-optimize -ftree-loop-distribution -fgraphite-identity -ftree-vectorize"
DISTDIR="/usr/portage/distfiles"
EMERGE_DEFAULT_OPTS="--keep-going y --with-bdeps y"
FCFLAGS="-O2 -pipe"
FEATURES="assume-digests binpkg-logs cgroup compress-build-logs config-protect-if-modified distcc distlocks ebuild-locks ipc-sandbox merge-sync news parallel-fetch protect-owned sandbox sfperms split-elog split-log strict test unknown-features-warn unmerge-logs unmerge-orphans userfetch userpriv usersandbox usersync xattr"
FFLAGS="-O2 -pipe"
GENTOO_MIRRORS="http://tux.rainside.sk/gentoo/ http://mirror.leaseweb.com/gentoo/ http://ftp.uni-erlangen.de/pub/mirrors/gentoo http://ftp.spline.inf.fu-berlin.de/mirrors/gentoo/"
LANG="it_IT.UTF-8"
LDFLAGS="-Wl,-O1 -Wl,--as-needed -Wl,--hash-style=gnu -Wl,--sort-common -flto=8 -fuse-linker-plugin -floop-nest-optimize -ftree-loop-distribution -fgraphite-identity -ftree-vectorize"
MAKEOPTS="-j11 -l8"
PKGDIR="/usr/portage/packages"
PORTAGE_CONFIGROOT="/"
PORTAGE_RSYNC_OPTS="--recursive --links --safe-links --perms --times --omit-dir-times --compress --force --whole-file --delete --stats --human-readable --timeout=180 --exclude=/distfiles --exclude=/local --exclude=/packages --exclude=/.git"
PORTAGE_TMPDIR="/var/tmp"
USE="X a52 aac aalib acl acpi adns alsa amd64 ao audiofile bash-completion bluetooth branding bzip2 cairo caps cdda cddb cdparanoia cdr cli cracklib crypt css cups curl cxx dbus declarative dga djvu dri dts dvd dvdr emboss encode exif expat fbcon ffmpeg fftw firefox flac fontconfig foomaticdb fortran ftp gd gdbm geoip gif gimp glamor gmp gnutls gphoto2 gpm graphviz gtk handbook iconv icu idn imagemagick imlib ipv6 java javascript jbig jpeg jpeg2k kde kipi kwallet lame lcms libass libcaca libnotify libsamplerate lm_sensors lua lzma lzo mad mmap mng modules mp3 mp4 mpeg mplayer multilib musicbrainz ncurses nls nptl nsplugin offensive ogg openal openexr opengl openmp pam pango pcre pdf phonon plasma png policykit postscript ppds pulseaudio qml qt3support qt4 qt5 rdesktop readline recode samba sctp sdl seccomp session sndfile sockets speex spell sqlite ssl startup-notification subversion svg symlink syslog systemd sysvipc taglib theora threads tidy tiff truetype udev udisks unicode upower usb vaapi vcd vim-syntax vnc vorbis wayland widgets win32codecs wmf wxwidgets x264 xattr xcb xcomposite xine xinerama xml xpm xscreensaver xv xvid yahoo zlib" ABI_X86="64" ALSA_CARDS="hda-intel virmidi" APACHE2_MODULES="authn_core authz_core socache_shmcb unixd actions alias auth_basic authn_alias authn_anon authn_dbm authn_default authn_file authz_dbm authz_default authz_groupfile authz_host authz_owner authz_user autoindex cache cgi cgid dav dav_fs dav_lock deflate dir disk_cache env expires ext_filter file_cache filter headers include info log_config logio mem_cache mime mime_magic negotiation rewrite setenvif speling status unique_id userdir usertrack vhost_alias" CALLIGRA_FEATURES="kexi words flow plan sheets stage tables krita karbon braindump author" CAMERAS="kodak ptp2" COLLECTD_PLUGINS="df interface irq load memory rrdtool swap syslog" CPU_FLAGS_X86="aes avx mmx mmxext popcnt sse sse2 sse3 sse4_1 sse4_2 ssse3" CURL_SSL="gnutls" ELIBC="glibc" GPSD_PROTOCOLS="ashtech aivdm earthmate evermore fv18 garmin garmintxt gpsclock isync itrax mtk3301 nmea ntrip navcom oceanserver oldstyle oncore rtcm104v2 rtcm104v3 sirf skytraq superstar2 timing tsip tripmate tnt ublox ubx" GRUB_PLATFORMS="pc" INPUT_DEVICES="libinput" KERNEL="linux" L10N="it en" LCD_DEVICES="bayrad cfontz cfontz633 glk hd44780 lb216 lcdm001 mtxorb ncurses text" LIBREOFFICE_EXTENSIONS="nlpsolver" LINGUAS="it it_IT" OFFICE_IMPLEMENTATION="libreoffice" PHP_TARGETS="php5-6" PYTHON_TARGETS="python2_7 python3_5 pypy pypy3" RUBY_TARGETS="ruby22" USERLAND="GNU" VIDEO_CARDS="intel i965" XTABLES_ADDONS="quota2 psd pknock lscan length2 ipv4options ipset ipp2p iface geoip fuzzy condition tee tarpit sysrq steal rawnat logmark ipmark dhcpmac delude chaos account"
Unset:  CC, CPPFLAGS, CTARGET, CXX, INSTALL_MASK, LC_ALL, PORTAGE_BUNZIP2_COMMAND, PORTAGE_COMPRESS, PORTAGE_COMPRESS_FLAGS, PORTAGE_RSYNC_EXTRA_OPTS, USE_PYTHON

=================================================================
                        Package Settings
=================================================================

dev-python/pyflakes-1.2.3::gentoo was built with the following:
USE="" ABI_X86="64" PYTHON_TARGETS="pypy pypy3 python2_7 python3_5 -python3_4 -python3_6"

# emerge -1pqv =dev-python/pyflakes-1.2.3
[ebuild   R   ] dev-python/pyflakes-1.2.3  PYTHON_TARGETS="pypy pypy3 python2_7 python3_5 -python3_4 (-python3_6)"
Comment 1 Paolo Pedroni 2017-05-08 12:41:39 UTC
Sorry, I pasted a log from pyflakes-1.5.0. the right one is as follows (the error is the same, though):

 * pypy3: running distutils-r1_run_phase python_test
/usr/bin/pypy3 setup.py test --quiet
running test
running egg_info
writing pyflakes.egg-info/PKG-INFO
writing dependency_links to pyflakes.egg-info/dependency_links.txt
writing entry points to pyflakes.egg-info/entry_points.txt
writing top-level names to pyflakes.egg-info/top_level.txt
reading manifest file 'pyflakes.egg-info/SOURCES.txt'
reading manifest template 'MANIFEST.in'
writing manifest file 'pyflakes.egg-info/SOURCES.txt'
running build_ext
......F................................................................s..........ss..s.........s.s..................s...s.........
....s...............................s.................................................................s............................
..s...s.............s...............................s...................................................s................s......s..
.........................................s..........ss..s.........s.s.sss..................s................s......s...............
..................s......s....................
======================================================================
FAIL: test_invalidEscape (pyflakes.test.test_api.CheckTests)
----------------------------------------------------------------------
Traceback (most recent call last):
  File "/var/tmp/portage/dev-python/pyflakes-1.2.3/work/pyflakes-1.2.3/pyflakes/test/test_api.py", line 482, in test_invalidEscape
    sourcePath, [decoding_error])
  File "/var/tmp/portage/dev-python/pyflakes-1.2.3/work/pyflakes-1.2.3/pyflakes/test/test_api.py", line 287, in assertHasErrors
    (count, err.getvalue()), (len(errorList), ''.join(errorList)))
AssertionError: Tuples differ: (1, "[60 chars]1:6: (unicode error) 'unicodeescape' codec can[77 chars]^\n") != (1, "[60 chars]1:6: 
UnicodeDecodeError: ('unicodeescape', b'\[64 chars]^\n")

First differing element 1:
"/var[56 chars]1:6: (unicode error) 'unicodeescape' codec can[76 chars] ^\n"
"/var[56 chars]1:6: UnicodeDecodeError: ('unicodeescape', b'\[63 chars] ^\n"

  (1,
-  '/var/tmp/portage/dev-python/pyflakes-1.2.3/temp/tmpawl5a3zp:1:6: (unicode '
?                                                                    ---------

+  '/var/tmp/portage/dev-python/pyflakes-1.2.3/temp/tmpawl5a3zp:1:6: '
-  "error) 'unicodeescape' codec can't decode bytes in position 0-1: truncated "
-  '\\xXX escape\n'
+  "UnicodeDecodeError: ('unicodeescape', b'\\\\xyz', 0, 2, 'truncated \\\\xXX "
+  "escape')\n"
   "foo = '\\xyz'\n"
   '     ^\n')

----------------------------------------------------------------------
Ran 570 tests in 1.784s

FAILED (failures=1, skipped=32)
Test failed: <unittest.runner.TextTestResult run=570 errors=0 failures=1>
error: Test failed: <unittest.runner.TextTestResult run=570 errors=0 failures=1>
Comment 2 Paolo Pedroni 2018-02-08 14:06:42 UTC
With pypy3-5.10.1 it also fails test_nonDefaultFollowsDefaultSyntaxError and test_nonKeywordAfterKeywordSyntaxError tests: 

 * pypy3: running distutils-r1_run_phase python_test
/usr/bin/pypy3 setup.py test --quiet
running test
running egg_info
writing pyflakes.egg-info/PKG-INFO
writing dependency_links to pyflakes.egg-info/dependency_links.txt
writing entry points to pyflakes.egg-info/entry_points.txt
writing top-level names to pyflakes.egg-info/top_level.txt
reading manifest file 'pyflakes.egg-info/SOURCES.txt'
reading manifest template 'MANIFEST.in'
writing manifest file 'pyflakes.egg-info/SOURCES.txt'
running build_ext
......F.....FF.........................................................s..........ss..s.........s.s..................s...s.............s...............................s.................................................................s..............................s...s.............s...............................s...................................................s................s......s...........................................s..........ss..s.........s.s.sss..................s................s......s.................................s......s....................
======================================================================
FAIL: test_invalidEscape (pyflakes.test.test_api.CheckTests)
----------------------------------------------------------------------
Traceback (most recent call last):
  File "/var/tmp/portage/dev-python/pyflakes-1.2.3/work/pyflakes-1.2.3/pyflakes/test/test_api.py", line 482, in test_invalidEscape
    sourcePath, [decoding_error])
  File "/var/tmp/portage/dev-python/pyflakes-1.2.3/work/pyflakes-1.2.3/pyflakes/test/test_api.py", line 287, in assertHasErrors
    (count, err.getvalue()), (len(errorList), ''.join(errorList)))
AssertionError: Tuples differ: (1, "[60 chars]1:6: (unicode error) 'unicodeescape' codec can[77 chars]^\n") != (1, "[60 chars]1:6: UnicodeDecodeError: ('unicodeescape', b'\[64 chars]^\n")

First differing element 1:
"/var[56 chars]1:6: (unicode error) 'unicodeescape' codec can[76 chars] ^\n"
"/var[56 chars]1:6: UnicodeDecodeError: ('unicodeescape', b'\[63 chars] ^\n"

  (1,
-  '/var/tmp/portage/dev-python/pyflakes-1.2.3/temp/tmp91zjafoh:1:6: (unicode '
?                                                                    ---------

+  '/var/tmp/portage/dev-python/pyflakes-1.2.3/temp/tmp91zjafoh:1:6: '
-  "error) 'unicodeescape' codec can't decode bytes in position 0-1: truncated "
-  '\\xXX escape\n'
+  "UnicodeDecodeError: ('unicodeescape', b'\\\\xyz', 0, 2, 'truncated \\\\xXX "
+  "escape')\n"
   "foo = '\\xyz'\n"
   '     ^\n')

======================================================================
FAIL: test_nonDefaultFollowsDefaultSyntaxError (pyflakes.test.test_api.CheckTests)
----------------------------------------------------------------------
Traceback (most recent call last):
  File "/var/tmp/portage/dev-python/pyflakes-1.2.3/work/pyflakes-1.2.3/pyflakes/test/test_api.py", line 429, in test_nonDefaultFollowsDefaultSyntaxError
    %s""" % (sourcePath, column, last_line)])
  File "/var/tmp/portage/dev-python/pyflakes-1.2.3/work/pyflakes-1.2.3/pyflakes/test/test_api.py", line 287, in assertHasErrors
    (count, err.getvalue()), (len(errorList), ''.join(errorList)))
AssertionError: Tuples differ: (1, '[57 chars]3o:1:7: non-default argument follows default a[39 chars]^\n') != (1, '[57 chars]3o:1:8: non-default argument follows default a[40 chars]^\n')

First differing element 1:
'/var[53 chars]3o:1:7: non-default argument follows default a[38 chars] ^\n'
'/var[53 chars]3o:1:8: non-default argument follows default a[39 chars] ^\n'

  (1,
-  '/var/tmp/portage/dev-python/pyflakes-1.2.3/temp/tmprky8_x3o:1:7: non-default '
?                                                                 ^

+  '/var/tmp/portage/dev-python/pyflakes-1.2.3/temp/tmprky8_x3o:1:8: non-default '
?                                                                 ^

   'argument follows default argument\n'
   'def foo(bar=baz, bax):\n'
-  '      ^\n')
+  '       ^\n')
?   +


======================================================================
FAIL: test_nonKeywordAfterKeywordSyntaxError (pyflakes.test.test_api.CheckTests)
----------------------------------------------------------------------
Traceback (most recent call last):
  File "/var/tmp/portage/dev-python/pyflakes-1.2.3/work/pyflakes-1.2.3/pyflakes/test/test_api.py", line 454, in test_nonKeywordAfterKeywordSyntaxError
    %s""" % (sourcePath, column, message, last_line)])
  File "/var/tmp/portage/dev-python/pyflakes-1.2.3/work/pyflakes-1.2.3/pyflakes/test/test_api.py", line 287, in assertHasErrors
    (count, err.getvalue()), (len(errorList), ''.join(errorList)))
AssertionError: Tuples differ: (1, '[58 chars]0:1:12: positional argument follows keyword ar[38 chars]^\n') != (1, '[58 chars]0:1:13: positional argument follows keyword ar[39 chars]^\n')

First differing element 1:
'/var[54 chars]0:1:12: positional argument follows keyword ar[37 chars] ^\n'
'/var[54 chars]0:1:13: positional argument follows keyword ar[38 chars] ^\n'

  (1,
-  '/var/tmp/portage/dev-python/pyflakes-1.2.3/temp/tmpa6upnrn0:1:12: positional '
?                                                                  ^

+  '/var/tmp/portage/dev-python/pyflakes-1.2.3/temp/tmpa6upnrn0:1:13: positional '
?                                                                  ^

   'argument follows keyword argument\n'
   'foo(bar=baz, bax)\n'
-  '           ^\n')
+  '            ^\n')
?   +


----------------------------------------------------------------------
Ran 570 tests in 2.415s

FAILED (failures=3, skipped=32)
Test failed: <unittest.runner.TextTestResult run=570 errors=0 failures=3>
error: Test failed: <unittest.runner.TextTestResult run=570 errors=0 failures=3>
Comment 3 Paolo Pedroni 2018-02-08 14:07:24 UTC
Same goes for dev-python/pyflakes-1.6.0