Gentoo Websites Logo
Go to: Gentoo Home Documentation Forums Lists Bugs Planet Store Wiki Get Gentoo!
Bug 612030 - app-editors/vim-8.0.0386 fails tests: Found errors in Test_exit_callback_interval()
Summary: app-editors/vim-8.0.0386 fails tests: Found errors in Test_exit_callback_inte...
Status: CONFIRMED
Alias: None
Product: Gentoo Linux
Classification: Unclassified
Component: Current packages (show other bugs)
Hardware: All Linux
: Normal normal (vote)
Assignee: Vim Maintainers
URL:
Whiteboard:
Keywords: TESTFAILURE
Depends on:
Blocks:
 
Reported: 2017-03-08 05:54 UTC by Markus Meier
Modified: 2017-03-08 05:54 UTC (History)
0 users

See Also:
Package list:
Runtime testing required: ---


Attachments
vim-8.0.0386.log.tar.bz2 (vim-8.0.0386.log.tar.bz2,190.21 KB, application/x-bzip2)
2017-03-08 05:54 UTC, Markus Meier
Details

Note You need to log in before you can comment on or make changes to this bug.
Description Markus Meier gentoo-dev 2017-03-08 05:54:53 UTC
Created attachment 466310 [details]
vim-8.0.0386.log.tar.bz2

I think this is not a regression. Not sure if this is arm specific.

 * Package:    app-editors/vim-8.0.0386
 * Repository: gentoo
 * Maintainer: vim@gentoo.org
 * USE:        X acl arm elibc_glibc gpm kernel_linux nls python_targets_python2_7 python_targets_python3_4 userland_GNU
 * FEATURES:   preserve-libs sandbox test userpriv usersandbox


Executed 286 tests


From test_channel.vim:
Found errors in Test_exit_callback_interval():
function RunTheTest[21]..Test_exit_callback_interval line 11: Expected True but got 0
function RunTheTest[21]..Test_exit_callback_interval line 29: Expected True but got 0

Test results:


From test_channel.vim:
Found errors in Test_exit_callback_interval():
function RunTheTest[21]..Test_exit_callback_interval line 11: Expected True but got 0
function RunTheTest[21]..Test_exit_callback_interval line 29: Expected True but got 0
TEST FAILURE
make: *** [Makefile:43: report] Error 1
make: Leaving directory '/var/tmp/portage/app-editors/vim-8.0.0386/work/vim-8.0.0386/src/testdir'
 * ERROR: app-editors/vim-8.0.0386::gentoo failed (test phase):
 *   emake failed

Portage 2.3.3 (python 2.7.12-final-0, default/linux/arm/13.0/armv5te/desktop, gcc-4.9.4, glibc-2.23-r3, 3.10.25-gentoo armv5tel)
=================================================================
System uname: Linux-3.10.25-gentoo-armv5tel-Feroceon_88FR131_rev_1_-v5l-with-gentoo-2.3
KiB Mem:      513244 total,    179716 free
KiB Swap:    1535996 total,    835164 free
Timestamp of repository gentoo: Sun, 05 Mar 2017 15:30:01 +0000
sh bash 4.3_p48-r1
ld GNU ld (Gentoo 2.25.1 p1.1) 2.25.1
distcc 3.2rc1 armv5tel-softfloat-linux-gnueabi [disabled]
ccache version 3.2.4 [disabled]
app-shells/bash:          4.3_p48-r1::gentoo
dev-lang/perl:            5.22.3_rc4::gentoo
dev-lang/python:          2.7.12::gentoo, 3.4.5::gentoo
dev-util/ccache:          3.2.4::gentoo
dev-util/cmake:           3.7.2::gentoo
sys-apps/baselayout:      2.3::gentoo
sys-apps/openrc:          0.23.2::gentoo
sys-apps/sandbox:         2.10-r3::gentoo
sys-devel/autoconf:       2.13::gentoo, 2.69::gentoo
sys-devel/automake:       1.4_p6-r2::gentoo, 1.5-r2::gentoo, 1.6.3-r2::gentoo, 1.7.9-r3::gentoo, 1.8.5-r5::gentoo, 1.9.6-r4::gentoo, 1.10.3-r1::gentoo, 1.11.6-r1::gentoo, 1.12.6::gentoo, 1.13.4::gentoo, 1.14.1::gentoo, 1.15::gentoo
sys-devel/binutils:       2.25.1-r1::gentoo
sys-devel/gcc:            4.9.4::gentoo
sys-devel/gcc-config:     1.7.3::gentoo
sys-devel/libtool:        2.4.6-r3::gentoo
sys-devel/make:           4.2.1::gentoo
sys-kernel/linux-headers: 4.4::gentoo (virtual/os-headers)
sys-libs/glibc:           2.23-r3::gentoo
Repositories:

gentoo
    location: /usr/portage
    sync-type: rsync
    sync-uri: rsync://192.168.1.100/gentoo-portage
    priority: -1000

ACCEPT_KEYWORDS="arm"
ACCEPT_LICENSE="* -@EULA"
CBUILD="armv5tel-softfloat-linux-gnueabi"
CFLAGS="-O2 -march=armv5te -pipe"
CHOST="armv5tel-softfloat-linux-gnueabi"
CONFIG_PROTECT="/etc /etc/omega.conf /etc/stunnel/stunnel.conf /usr/share/easy-rsa /usr/share/gnupg/qualified.txt /var/bind /var/vpopmail/etc"
CONFIG_PROTECT_MASK="/etc/ca-certificates.conf /etc/dconf /etc/env.d /etc/fonts/fonts.conf /etc/gconf /etc/gentoo-release /etc/php/apache2-php5.5/ext-active/ /etc/php/apache2-php5.6/ext-active/ /etc/php/cgi-php5.5/ext-active/ /etc/php/cgi-php5.6/ext-active/ /etc/php/cli-php5.5/ext-active/ /etc/php/cli-php5.6/ext-active/ /etc/revdep-rebuild /etc/sandbox.d /etc/terminfo /etc/texmf/language.dat.d /etc/texmf/language.def.d /etc/texmf/updmap.d /etc/texmf/web2c"
CXXFLAGS="-O2 -march=armv5te -pipe"
DISTDIR="/mnt/distfiles"
EMERGE_DEFAULT_OPTS="--quiet-build=n --jobs=2 --keep-going --with-bdeps=y --backtrack=3"
FCFLAGS="-O2 -pipe -march=armv5te"
FEATURES="assume-digests binpkg-logs collision-protect config-protect-if-modified distlocks ebuild-locks fixlafiles merge-sync news parallel-fetch preserve-libs protect-owned sandbox sfperms strict test test-fail-continue unknown-features-warn unmerge-logs unmerge-orphans userfetch userpriv usersandbox usersync xattr"
FFLAGS="-O2 -pipe -march=armv5te"
GENTOO_MIRRORS="http://distfiles.gentoo.org"
LANG="en_GB.utf8"
LDFLAGS="-Wl,-O1 -Wl,--as-needed"
MAKEOPTS="-j2"
PKGDIR="/usr/portage/packages"
PORTAGE_CONFIGROOT="/"
PORTAGE_RSYNC_OPTS="--recursive --links --safe-links --perms --times --omit-dir-times --compress --force --whole-file --delete --stats --human-readable --timeout=180 --exclude=/distfiles --exclude=/local --exclude=/packages --exclude=/.git"
PORTAGE_TMPDIR="/var/tmp"
USE="X a52 aac acl acpi alsa apache2 arm berkdb bluetooth branding bzip2 cairo cdda cdr cli consolekit cracklib crypt cups cxx dbus dri dts dvd dvdr emboss encode exif fam firefox flac fortran gdbm gif glamor gpm gtk iconv jpeg kpathsea lcms ldap libnotify mad mng modules mp3 mp4 mpeg ncurses nls nptl ogg opengl openmp pam pango pcre pdf png policykit ppds qt3support qt4 readline sdl seccomp session spell ssl startup-notification svg tcpd test tiff truetype udev udisks unicode upower usb vorbis wxwidgets x264 xattr xcb xml xv xvid zlib" APACHE2_MODULES="authn_core authz_core socache_shmcb unixd actions alias auth_basic authn_alias authn_anon authn_dbm authn_default authn_file authz_dbm authz_default authz_groupfile authz_host authz_owner authz_user autoindex cache cgi cgid dav dav_fs dav_lock deflate dir disk_cache env expires ext_filter file_cache filter headers include info log_config logio mem_cache mime mime_magic negotiation rewrite setenvif speling status unique_id userdir usertrack vhost_alias" CALLIGRA_FEATURES="kexi words flow plan sheets stage tables krita karbon braindump author" COLLECTD_PLUGINS="df interface irq load memory rrdtool swap syslog" ELIBC="glibc" GPSD_PROTOCOLS="ashtech aivdm earthmate evermore fv18 garmin garmintxt gpsclock isync itrax mtk3301 nmea ntrip navcom oceanserver oldstyle oncore rtcm104v2 rtcm104v3 sirf skytraq superstar2 timing tsip tripmate tnt ublox ubx" INPUT_DEVICES="libinput keyboard mouse" KERNEL="linux" LCD_DEVICES="bayrad cfontz cfontz633 glk hd44780 lb216 lcdm001 mtxorb ncurses text" LIBREOFFICE_EXTENSIONS="presenter-console presenter-minimizer" OFFICE_IMPLEMENTATION="libreoffice" PHP_TARGETS="php5-6" PYTHON_SINGLE_TARGET="python2_7" PYTHON_TARGETS="python2_7 python3_4" RUBY_TARGETS="ruby21" USERLAND="GNU" VIDEO_CARDS="exynos freedreno omap" XTABLES_ADDONS="quota2 psd pknock lscan length2 ipv4options ipset ipp2p iface geoip fuzzy condition tee tarpit sysrq steal rawnat logmark ipmark dhcpmac delude chaos account"
Unset:  CC, CPPFLAGS, CTARGET, CXX, INSTALL_MASK, LC_ALL, PORTAGE_BUNZIP2_COMMAND, PORTAGE_COMPRESS, PORTAGE_COMPRESS_FLAGS, PORTAGE_RSYNC_EXTRA_OPTS, USE_PYTHON