Gentoo Websites Logo
Go to: Gentoo Home Documentation Forums Lists Bugs Planet Store Wiki Get Gentoo!
Bug 592538 - dev-qt/qtnetwork:5 fails to build with >=dev-libs/openssl-1.1.0
Summary: dev-qt/qtnetwork:5 fails to build with >=dev-libs/openssl-1.1.0
Status: RESOLVED FIXED
Alias: None
Product: Gentoo Linux
Classification: Unclassified
Component: Current packages (show other bugs)
Hardware: All Linux
: Normal normal (vote)
Assignee: Qt Bug Alias
URL: https://bugreports.qt.io/browse/QTBUG...
Whiteboard: fixed in Qt 5.11.1
Keywords:
: 634412 (view as bug list)
Depends on:
Blocks: openssl-1.1
  Show dependency tree
 
Reported: 2016-08-31 07:57 UTC by Lars Wendler (Polynomial-C) (RETIRED)
Modified: 2018-09-29 18:10 UTC (History)
1 user (show)

See Also:
Package list:
Runtime testing required: ---


Attachments
build.log (build.log,115.00 KB, text/plain)
2016-08-31 07:57 UTC, Lars Wendler (Polynomial-C) (RETIRED)
Details
qtnetwork-5.9.4-openssl-1.1.patch (qtnetwork-5.9.4-openssl-1.1.patch,175.21 KB, patch)
2018-04-24 11:26 UTC, Lars Wendler (Polynomial-C) (RETIRED)
Details | Diff

Note You need to log in before you can comment on or make changes to this bug.
Description Lars Wendler (Polynomial-C) (RETIRED) gentoo-dev 2016-08-31 07:57:45 UTC
Created attachment 444542 [details]
build.log

x86_64-pc-linux-gnu-g++ -c -march=native -mtune=native -O2 -pipe -std=c++1z -fvisibility=hidden -fvisibility-inlines-hidden -fno-exceptions -Wall -W -D_REENTRANT -fPIC -DQT_NO_MTDEV -DQT_NO_EVDEV -DQT_NO_TSLIB -
DQT_NO_LIBINPUT -DQT_NO_USING_NAMESPACE -DQT_USE_SYSTEM_PROXIES -DQT_BUILD_NETWORK_LIB -DQT_BUILDING_QT -DQT_NO_CAST_TO_ASCII -DQT_ASCII_CAST_WARNINGS -DQT_MOC_COMPAT -DQT_USE_QSTRINGBUILDER -DQT_DEPRECATED_WARN
INGS -DQT_DISABLE_DEPRECATED_BEFORE=0x050000 -DQT_NO_EXCEPTIONS -D_LARGEFILE64_SOURCE -D_LARGEFILE_SOURCE -DQT_NO_DEBUG -DQT_CORE_LIB -I. -Ikernel -I../../include -I../../include/QtNetwork -I../../include/QtNetw
ork/5.6.1 -I../../include/QtNetwork/5.6.1/QtNetwork -isystem /usr/include/qt5/QtCore/5.6.1 -isystem /usr/include/qt5/QtCore/5.6.1/QtCore -isystem /usr/include/qt5 -isystem /usr/include/qt5/QtCore -I.moc -I../../
mkspecs/linux-g++ -o .obj/qsslcertificate.o ssl/qsslcertificate.cpp
In file included from ssl/qsslsocket_openssl_symbols_p.h:64:0,
                 from ssl/qsslcertificate.cpp:110:
ssl/qsslsocket_openssl_p.h:95:9: error: ‘_STACK’ does not name a type
 typedef _STACK STACK;
         ^
In file included from ssl/qsslcertificate.cpp:110:0:
ssl/qsslsocket_openssl_symbols_p.h:304:14: error: ‘STACK’ was not declared in this scope
 int q_sk_num(STACK *a);
              ^
ssl/qsslsocket_openssl_symbols_p.h:304:21: error: ‘a’ was not declared in this scope
 int q_sk_num(STACK *a);
                     ^
ssl/qsslsocket_openssl_symbols_p.h:305:20: error: variable or field ‘q_sk_pop_free’ declared void
 void q_sk_pop_free(STACK *a, void (*b)(void *));
                    ^
ssl/qsslsocket_openssl_symbols_p.h:305:20: error: ‘STACK’ was not declared in this scope
ssl/qsslsocket_openssl_symbols_p.h:305:27: error: ‘a’ was not declared in this scope
 void q_sk_pop_free(STACK *a, void (*b)(void *));
                           ^
ssl/qsslsocket_openssl_symbols_p.h:305:37: error: ‘b’ was not declared in this scope
 void q_sk_pop_free(STACK *a, void (*b)(void *));
                                     ^
ssl/qsslsocket_openssl_symbols_p.h:305:40: error: expected primary-expression before ‘void’
 void q_sk_pop_free(STACK *a, void (*b)(void *));
                                        ^
ssl/qsslsocket_openssl_symbols_p.h:307:1: error: ‘_STACK’ does not name a type
 _STACK *q_sk_new_null();
 ^
ssl/qsslsocket_openssl_symbols_p.h:308:16: error: variable or field ‘q_sk_push’ declared void
 void q_sk_push(_STACK *st, void *data);
                ^
ssl/qsslsocket_openssl_symbols_p.h:308:16: error: ‘_STACK’ was not declared in this scope
ssl/qsslsocket_openssl_symbols_p.h:308:24: error: ‘st’ was not declared in this scope
 void q_sk_push(_STACK *st, void *data);
                        ^
ssl/qsslsocket_openssl_symbols_p.h:308:28: error: expected primary-expression before ‘void’
 void q_sk_push(_STACK *st, void *data);
                            ^
ssl/qsslsocket_openssl_symbols_p.h:309:16: error: variable or field ‘q_sk_free’ declared void
 void q_sk_free(_STACK *a);
                ^
ssl/qsslsocket_openssl_symbols_p.h:309:16: error: ‘_STACK’ was not declared in this scope
ssl/qsslsocket_openssl_symbols_p.h:309:24: error: ‘a’ was not declared in this scope
 void q_sk_free(_STACK *a);
                        ^
ssl/qsslsocket_openssl_symbols_p.h:310:19: error: ‘STACK’ was not declared in this scope
 void * q_sk_value(STACK *a, int b);
                   ^
ssl/qsslsocket_openssl_symbols_p.h:310:26: error: ‘a’ was not declared in this scope
 void * q_sk_value(STACK *a, int b);
                          ^
ssl/qsslsocket_openssl_symbols_p.h:310:29: error: expected primary-expression before ‘int’
 void * q_sk_value(STACK *a, int b);
                             ^
ssl/qsslsocket_openssl_symbols_p.h:310:34: error: expression list treated as compound expression in initializer [-fpermissive]
 void * q_sk_value(STACK *a, int b);
                                  ^
make: *** [Makefile:18925: .obj/qsslcertificate.o] Error 1
Comment 1 Mark Wright gentoo-dev 2017-10-14 01:07:34 UTC
dev-qt/qtnetwork-5.10.9999 in the qt overlay builds fine with dev-libs/openssl-1.1.0f
Comment 2 Martin Mokrejš 2017-10-15 23:53:11 UTC
I have same problem with gcc-5.4.0 and 

# emerge -pv openssl

[ebuild   R   #] dev-libs/openssl-1.1.0f:0/1.1::gentoo  USE="asm bindist sctp zlib -rfc3779 -static-libs {-test} -tls-heartbeat -vanilla" ABI_X86="32 (64) (-x32)" CPU_FLAGS_X86="(sse2)" 0 KiB


# emerge --info '=dev-qt/qtnetwork-5.9.2::gentoo'
Portage 2.3.11 (python 3.4.6-final-0, default/linux/amd64/13.0, gcc-5.4.0, glibc-2.25-r7, 4.13.6 x86_64)
=================================================================
                         System Settings
=================================================================
System uname: Linux-4.13.6-x86_64-Intel-R-_Core-TM-_i7-6700HQ_CPU_@_2.60GHz-with-gentoo-2.4.1
KiB Mem:    16387480 total,   1839744 free
KiB Swap:          0 total,         0 free
Timestamp of repository gentoo: Sat, 14 Oct 2017 08:30:01 +0000
Head commit of repository gentoo: 3d87a84e9efadd125720c7caf8b5045948353547
sh bash 4.4_p12
ld GNU ld (Gentoo 2.25.1 p1.1) 2.25.1
app-shells/bash:          4.4_p12::gentoo
dev-java/java-config:     2.2.0-r3::gentoo
dev-lang/perl:            5.24.1-r2::gentoo
dev-lang/python:          2.7.14::gentoo, 3.4.6::gentoo
dev-util/cmake:           3.9.0::gentoo
dev-util/pkgconfig:       0.29.2::gentoo
sys-apps/baselayout:      2.4.1-r2::gentoo
sys-apps/openrc:          0.33::gentoo
sys-apps/sandbox:         2.12::gentoo
sys-devel/autoconf:       2.13::gentoo, 2.69-r4::gentoo
sys-devel/automake:       1.11.6-r2::gentoo, 1.13.4-r1::gentoo, 1.14.1-r1::gentoo, 1.15.1-r1::gentoo
sys-devel/binutils:       2.25.1-r1::gentoo, 2.27::gentoo, 2.28-r2::gentoo, 2.29.1::gentoo
sys-devel/gcc:            4.2.4-r1::gentoo, 4.3.6-r1::gentoo, 4.4.7::gentoo, 4.7.4::gentoo, 4.8.5::gentoo, 4.9.4::gentoo, 5.4.0-r3::gentoo, 6.3.0::gentoo, 6.4.0::gentoo
sys-devel/gcc-config:     1.9.0::gentoo
sys-devel/libtool:        2.4.6-r4::gentoo
sys-devel/make:           4.2.1-r1::gentoo
sys-kernel/linux-headers: 4.13::gentoo (virtual/os-headers)
sys-libs/glibc:           2.25-r7::gentoo
Repositories:

gentoo
    location: /scratch/usr/portage
    sync-type: rsync
    sync-uri: rsync://rsync.gentoo.org/gentoo-portage
    priority: -1000
    sync-rsync-extra-opts: 

x-portage
    location: /scratch/usr/local/portage
    masters: gentoo
    priority: 0

x-layman
    location: /scratch/var/lib/layman
    masters: gentoo
    priority: 1

haskell
    location: /var/lib/layman/haskell
    masters: gentoo
    priority: 50

science
    location: /var/lib/layman/science
    masters: gentoo
    priority: 50

vmware
    location: /var/lib/layman/vmware
    masters: gentoo
    priority: 50

ACCEPT_KEYWORDS="amd64 ~amd64"
ACCEPT_LICENSE="* -@EULA dlj-1.1 sun-bcla-java-vm Oracle-BCLA-JavaSE IBM-J1.6 skype-eula Nero-EULA-US AdobeFlash-10.3 skype-4.0.0.7-copyright AdobeFlash-11.x OPERA-2014 RAR"
CBUILD="x86_64-pc-linux-gnu"
CFLAGS="-O2 -pipe -march=sandybridge -mtune=native -ftree-vectorize"
CHOST="x86_64-pc-linux-gnu"
CONFIG_PROTECT="/etc /etc/stunnel/stunnel.conf /usr/lib64/libreoffice/program/sofficerc /usr/share/easy-rsa /usr/share/gnupg/qualified.txt /usr/share/maven-bin-3.3/conf /var/lib/hsqldb /var/spool/torque"
CONFIG_PROTECT_MASK="/etc/ca-certificates.conf /etc/dconf /etc/env.d /etc/fonts/fonts.conf /etc/gconf /etc/gentoo-release /etc/revdep-rebuild /etc/sandbox.d /etc/terminfo /etc/texmf/language.dat.d /etc/texmf/language.def.d /etc/texmf/updmap.d /etc/texmf/web2c"
CXXFLAGS="-O2 -pipe -march=sandybridge -mtune=native -ftree-vectorize"
DISTDIR="/usr/portage/distfiles"
FCFLAGS="-O2 -pipe"
FEATURES="assume-digests binpkg-logs config-protect-if-modified distlocks ebuild-locks fixlafiles merge-sync multilib-strict news nostrip parallel-fetch preserve-libs protect-owned sandbox sfperms splitdebug strict unknown-features-warn unmerge-logs unmerge-orphans userfetch userpriv usersandbox usersync xattr"
FFLAGS="-O2 -pipe"
GENTOO_MIRRORS="http://gentoo.wheel.sk/ http://ftp.fi.muni.cz/pub/linux/gentoo/ http://gentoo.mirror.web4u.cz/ rsync://gentoo.mirror.dkm.cz/gentoo/ ftp://gentoo.mirror.web4u.cz/"
LDFLAGS="-Wl,-O1 -Wl,--as-needed"
MAKEOPTS="-j5"
PKGDIR="/usr/portage/packages"
PORTAGE_CONFIGROOT="/"
PORTAGE_RSYNC_OPTS="--recursive --links --safe-links --perms --times --omit-dir-times --compress --force --whole-file --delete --stats --human-readable --timeout=180 --exclude=/distfiles --exclude=/local --exclude=/packages --exclude=/.git"
PORTAGE_TMPDIR="/scratch/var/tmp"
USE="X acpi alsa amd64 amr apache apache2 apulse asm avx avx2 berkdb bindist bluetooth boost bzip2 cairo cgi cli coin consolekit cracklib crypt cryptlib cryptsetup cups cxx dbus device-mapper dhcp directfb drm dvd emboss encode fax fbcon ffmpeg flac fontconfig fortran gbm gcrypt gd gdbm geoip gimp glpk gmp gnutls gpm gtk hal hpijs hwdb iconv id3tag imaging innodb inotify java javafx javascript jce jpeg jpg js jscript keymap ladspa lapack laptop lcms libnotify lm_sensors mad matroska mmx modemmanager modules multilib mysql ncurses nfs nls nptl nptlonly nscd nss ntfsprogs objc ocr ogg opengl openmp openssl pam parport pcre pcre16 pdf perl php png policykit polkit ppds pppd python qt3support qt4 qt5 readline rendering resolvconf scanner sctp seccomp server session slideshow sndfile sqlite sse sse2 sse3 sse4_1 sse4_2 ssl ssse3 startup-notification suexec svg syslog tcl tcpd threads tiff tk truetype udev unicode usb v4l v4l2 vim-syntax vnc wavpack wifi x11 xattr xcb xml xorg xrandr xv xvid xvmc zlib" ABI_X86="64 32" ALSA_CARDS="ali5451 als4000 atiixp atiixp-modem bt87x ca0106 cmipci emu10k1x ens1370 ens1371 es1938 es1968 fm801 hda-intel intel8x0 intel8x0m maestro3 trident usb-audio via82xx via82xx-modem ymfpci" APACHE2_MODULES="alias authz_host auth_basic auth_digest cgi cgid deflate dir env filter include info mem_cache mime mime_magic negotiation remoteip setenvif status userdir vhost_alias rewrite usertrack cache file_cache disk_cache charset_lite log_config log_forensic" CALLIGRA_FEATURES="kexi words flow plan sheets stage tables krita karbon braindump author" COLLECTD_PLUGINS="df interface irq load memory rrdtool swap syslog" CPU_FLAGS_X86="aes avx mmx mmxext popcnt sse sse2 sse3 sse4_1 sse4_2 ssse3" ELIBC="glibc" GPSD_PROTOCOLS="ashtech aivdm earthmate evermore fv18 garmin garmintxt gpsclock isync itrax mtk3301 nmea ntrip navcom oceanserver oldstyle oncore rtcm104v2 rtcm104v3 sirf skytraq superstar2 timing tsip tripmate tnt ublox ubx" GRUB_PLATFORMS="pc efi-64" INPUT_DEVICES="libinput keyboard mouse" KERNEL="linux" L10N="en-US en en-GB cs" LCD_DEVICES="bayrad cfontz cfontz633 glk hd44780 lb216 lcdm001 mtxorb ncurses text" LIBREOFFICE_EXTENSIONS="presenter-console presenter-minimizer" LINGUAS="en_US en_GB en cs" OFFICE_IMPLEMENTATION="libreoffice" POSTGRES_TARGETS="postgres9_5" PYTHON_SINGLE_TARGET="python2_7" PYTHON_TARGETS="python2_7 python3_4" RUBY_TARGETS="ruby21 ruby23 ruby24" USERLAND="GNU" VIDEO_CARDS="vesa vmware fbdev intel i915 i965" XTABLES_ADDONS="quota2 psd pknock lscan length2 ipv4options ipset ipp2p iface geoip fuzzy condition tee tarpit sysrq steal rawnat logmark ipmark dhcpmac delude chaos account"
Unset:  CC, CPPFLAGS, CTARGET, CXX, EMERGE_DEFAULT_OPTS, INSTALL_MASK, LANG, LC_ALL, PORTAGE_BUNZIP2_COMMAND, PORTAGE_COMPRESS, PORTAGE_COMPRESS_FLAGS, PORTAGE_RSYNC_EXTRA_OPTS
Comment 3 Arfrever Frehtes Taifersar Arahesis 2017-10-17 00:45:36 UTC
*** Bug 634412 has been marked as a duplicate of this bug. ***
Comment 4 Lars Wendler (Polynomial-C) (RETIRED) gentoo-dev 2018-04-24 11:26:27 UTC
Created attachment 528420 [details, diff]
qtnetwork-5.9.4-openssl-1.1.patch

Self-backported patch for qtnetwork-5.9 series. Compile-tested against openssl-1.0.2* and openssl-1.1.0* but run-tested only with openssl-1.0.2*
Applies cleanly against qtnetwork-5.9.5 as well.
Comment 5 Andrew John Hughes 2018-06-20 17:17:31 UTC
5.9.5 built successfully with this patch and is being used to run QBitTorrent with OpenSSL 1.1.0:

http://fuseyism.com/patches/qtnetwork-openssl-1.1.0.patch
Comment 6 Lars Wendler (Polynomial-C) (RETIRED) gentoo-dev 2018-09-29 18:10:36 UTC
qt-5.11 is in the tree.