Gentoo Websites Logo
Go to: Gentoo Home Documentation Forums Lists Bugs Planet Store Wiki Get Gentoo!
Bug 591208 - media-libs/gst-plugins-bad-1.8.2[opengl] - Test suite requires xorg-server[-minimal] - Error creating master context No GLX extension
Summary: media-libs/gst-plugins-bad-1.8.2[opengl] - Test suite requires xorg-server[-m...
Alias: None
Product: Gentoo Linux
Classification: Unclassified
Component: Current packages (show other bugs)
Hardware: All Linux
: Normal normal (vote)
Assignee: GStreamer package maintainers
Depends on:
Reported: 2016-08-13 19:47 UTC by eroen
Modified: 2018-06-14 23:49 UTC (History)
0 users

See Also:
Package list:
Runtime testing required: ---

build.log.xz (build.log.xz,39.07 KB, application/x-xz)
2016-08-13 19:47 UTC, eroen
test-suite.log (test-suite.log,3.76 KB, text/plain)
2016-08-13 19:48 UTC, eroen

Note You need to log in before you can comment on or make changes to this bug.
Description eroen 2016-08-13 19:47:05 UTC
Created attachment 443246 [details]

GLX (among other things) is disabled in xorg-server[minimal].

PASS: libs/insertbin
FAIL: libs/gstglcontext
FAIL: libs/gstglmemory
FAIL: libs/gstglupload
FAIL: libs/gstglcolorconvert
FAIL: libs/gstglquery
PASS: libs/gstglsl
FAIL: elements/glimagesink
Testsuite summary for GStreamer Bad Plug-ins 1.8.2
# TOTAL: 46
# PASS:  40
# SKIP:  0
# XFAIL: 0
# FAIL:  6
# XPASS: 0
# ERROR: 0
See tests/check/test-suite.log
Please report to
Makefile:3563: recipe for target 'test-suite.log' failed
make[4]: *** [test-suite.log] Error 1
make[4]: Leaving directory '/var/tmp/portage/media-libs/gst-plugins-bad-1.8.2/work/gst-plugins-bad-1.8.2-abi_x86_64.amd64/tests/check'
Makefile:3669: recipe for target 'check-TESTS' failed
make[3]: *** [check-TESTS] Error 2
make[3]: Leaving directory '/var/tmp/portage/media-libs/gst-plugins-bad-1.8.2/work/gst-plugins-bad-1.8.2-abi_x86_64.amd64/tests/check'
Makefile:4253: recipe for target 'check-am' failed
make[2]: *** [check-am] Error 2
make[2]: Leaving directory '/var/tmp/portage/media-libs/gst-plugins-bad-1.8.2/work/gst-plugins-bad-1.8.2-abi_x86_64.amd64/tests/check'
Makefile:805: recipe for target 'check-recursive' failed
make[1]: *** [check-recursive] Error 1
make[1]: Leaving directory '/var/tmp/portage/media-libs/gst-plugins-bad-1.8.2/work/gst-plugins-bad-1.8.2-abi_x86_64.amd64/tests'
Makefile:977: recipe for target 'check-recursive' failed
make: *** [check-recursive] Error 1
emake failed
 * ERROR: media-libs/gst-plugins-bad-1.8.2::gentoo failed (test phase):
 *   Failed to run 'emake check -j1'
 * Call stack:
 *, line  133:  Called src_test
 *   environment, line 3238:  Called multilib-minimal_src_test
 *   environment, line 2432:  Called multilib_foreach_abi 'multilib-minimal_abi_src_test'
 *   environment, line 2604:  Called multibuild_foreach_variant '_multilib_multibuild_wrapper' 'multilib-minimal_abi_src_test'
 *   environment, line 2297:  Called _multibuild_run '_multilib_multibuild_wrapper' 'multilib-minimal_abi_src_test'
 *   environment, line 2295:  Called _multilib_multibuild_wrapper 'multilib-minimal_abi_src_test'
 *   environment, line  527:  Called multilib-minimal_abi_src_test
 *   environment, line 2426:  Called multilib_src_test
 *   environment, line 2838:  Called virtx 'emake' 'check' '-j1'
 *   environment, line 4171:  Called die
 * The specific snippet of code:
 *       [[ ${retval} -ne 0 ]] && die "Failed to run '$@'";
Comment 1 eroen 2016-08-13 19:48:27 UTC
Created attachment 443248 [details]

FAIL: libs/gstglcontext

Running suite(s): GstGLContext
0%: Checks: 6, Failures: 6, Errors: 0
/var/tmp/portage/media-libs/gst-plugins-bad-1.8.2/work/gst-plugins-bad-1.8.2/tests/check/libs/gstglcontext.c:248:F:general:test_share:0: Error creating master context No GLX extension

/var/tmp/portage/media-libs/gst-plugins-bad-1.8.2/work/gst-plugins-bad-1.8.2/tests/check/libs/gstglcontext.c:339:F:general:test_wrapped_context:0: Error creating master context No GLX extension

/var/tmp/portage/media-libs/gst-plugins-bad-1.8.2/work/gst-plugins-bad-1.8.2/tests/check/libs/gstglcontext.c:428:F:general:test_current_context:0: Error creating master context No GLX extension

/var/tmp/portage/media-libs/gst-plugins-bad-1.8.2/work/gst-plugins-bad-1.8.2/tests/check/libs/gstglcontext.c:459:F:general:test_context_can_share:0: Error creating context No GLX extension

/var/tmp/portage/media-libs/gst-plugins-bad-1.8.2/work/gst-plugins-bad-1.8.2/tests/check/libs/gstglcontext.c:500:F:general:test_is_shared:0: Error creating context No GLX extension

/var/tmp/portage/media-libs/gst-plugins-bad-1.8.2/work/gst-plugins-bad-1.8.2/tests/check/libs/gstglcontext.c:528:F:general:test_display_list:0: Error creating context No GLX extension

FAIL libs/gstglcontext (exit status: 6)

... and so on.
Comment 2 eroen 2016-08-13 19:49:03 UTC
localhost ~ # emerge --info '=media-libs/gst-plugins-bad-1.8.2::gentoo'
Portage 2.2.28 (python 2.7.10-final-0, default/linux/amd64/13.0, gcc-4.9.3, glibc-2.22-r4, 4.4.6-gentoo x86_64)
                         System Settings
System uname: Linux-4.4.6-gentoo-x86_64-Intel-R-_Core-TM-_i5-2520M_CPU_@_2.50GHz-with-gentoo-2.2
KiB Mem:     4043380 total,   3050856 free
KiB Swap:          0 total,         0 free
Timestamp of repository gentoo: Sat, 13 Aug 2016 00:45:01 +0000
sh bash 4.3_p42-r1
ld GNU ld (Gentoo 2.25.1 p1.1) 2.25.1
app-shells/bash:          4.3_p42-r1::gentoo
dev-lang/perl:            5.20.2::gentoo
dev-lang/python:          2.7.10-r1::gentoo, 3.4.3-r1::gentoo
dev-util/cmake:           3.3.1-r1::gentoo
dev-util/pkgconfig:       0.28-r2::gentoo
sys-apps/baselayout:      2.2::gentoo
sys-apps/openrc:          0.19.1::gentoo
sys-apps/sandbox:         2.10-r1::gentoo
sys-devel/autoconf:       2.69::gentoo
sys-devel/automake:       1.14.1::gentoo, 1.15::gentoo
sys-devel/binutils:       2.25.1-r1::gentoo
sys-devel/gcc:            4.9.3::gentoo
sys-devel/gcc-config:     1.7.3::gentoo
sys-devel/libtool:        2.4.6::gentoo
sys-devel/make:           4.1-r1::gentoo
sys-kernel/linux-headers: 4.3::gentoo (virtual/os-headers)
sys-libs/glibc:           2.22-r4::gentoo

    location: /usr/portage
    sync-type: rsync
    sync-uri: rsync://
    priority: -1000

CFLAGS="-O2 -pipe"
CONFIG_PROTECT_MASK="/etc/ca-certificates.conf /etc/env.d /etc/fonts/fonts.conf /etc/gconf /etc/gentoo-release /etc/sandbox.d /etc/terminfo"
CXXFLAGS="-O2 -pipe"
FCFLAGS="-O2 -pipe"
FEATURES="assume-digests binpkg-logs config-protect-if-modified distlocks ebuild-locks fixlafiles merge-sync news parallel-fetch preserve-libs protect-owned sandbox sfperms strict unknown-features-warn unmerge-logs unmerge-orphans userfetch userpriv usersandbox usersync xattr"
FFLAGS="-O2 -pipe"
LDFLAGS="-Wl,-O1 -Wl,--as-needed"
PORTAGE_RSYNC_OPTS="--recursive --links --safe-links --perms --times --omit-dir-times --compress --force --whole-file --delete --stats --human-readable --timeout=180 --exclude=/distfiles --exclude=/local --exclude=/packages --exclude=/.git"
USE="acl amd64 berkdb bindist bzip2 cli cracklib crypt cxx dri fortran gdbm iconv ipv6 mmx mmxext modules multilib ncurses nls nptl openmp pam pcre readline seccomp session sse sse2 ssl tcpd unicode xattr zlib" ABI_X86="64" ALSA_CARDS="ali5451 als4000 atiixp atiixp-modem bt87x ca0106 cmipci emu10k1x ens1370 ens1371 es1938 es1968 fm801 hda-intel intel8x0 intel8x0m maestro3 trident usb-audio via82xx via82xx-modem ymfpci" APACHE2_MODULES="authn_core authz_core socache_shmcb unixd actions alias auth_basic authn_alias authn_anon authn_dbm authn_default authn_file authz_dbm authz_default authz_groupfile authz_host authz_owner authz_user autoindex cache cgi cgid dav dav_fs dav_lock deflate dir disk_cache env expires ext_filter file_cache filter headers include info log_config logio mem_cache mime mime_magic negotiation rewrite setenvif speling status unique_id userdir usertrack vhost_alias" CALLIGRA_FEATURES="kexi words flow plan sheets stage tables krita karbon braindump author" CAMERAS="ptp2" COLLECTD_PLUGINS="df interface irq load memory rrdtool swap syslog" CPU_FLAGS_X86="mmx sse sse2" ELIBC="glibc" GPSD_PROTOCOLS="ashtech aivdm earthmate evermore fv18 garmin garmintxt gpsclock itrax mtk3301 nmea ntrip navcom oceanserver oldstyle oncore rtcm104v2 rtcm104v3 sirf superstar2 timing tsip tripmate tnt ublox ubx" INPUT_DEVICES="keyboard mouse evdev" KERNEL="linux" LCD_DEVICES="bayrad cfontz cfontz633 glk hd44780 lb216 lcdm001 mtxorb ncurses text" LIBREOFFICE_EXTENSIONS="presenter-console presenter-minimizer" OFFICE_IMPLEMENTATION="libreoffice" PHP_TARGETS="php5-5" PYTHON_SINGLE_TARGET="python2_7" PYTHON_TARGETS="python2_7 python3_4" RUBY_TARGETS="ruby20 ruby21" USERLAND="GNU" XTABLES_ADDONS="quota2 psd pknock lscan length2 ipv4options ipset ipp2p iface geoip fuzzy condition tee tarpit sysrq steal rawnat logmark ipmark dhcpmac delude chaos account"

localhost ~ # emerge -pqv '=media-libs/gst-plugins-bad-1.8.2::gentoo'
[ebuild  N    ] media-libs/gst-plugins-bad-1.8.2  USE="X introspection nls opengl orc {test} -egl -gles2 -gtk -vcd -vnc -wayland" ABI_X86="(64) -32 (-x32)" 

 * IMPORTANT: 10 news items need reading for repository 'gentoo'.
 * Use eselect news read to view new items.
Comment 3 Mart Raudsepp gentoo-dev 2018-06-14 23:49:01 UTC
I don't think xorg-server[minimal] is the problem; more about permissions and/or sandbox and the likes. I'm going to disable the GL tests in gst-plugins-base-1.14 to get other tests still ran by people, but it'd be good to know how to get EGL stuff to setup right in emerge src_test cases.