Gentoo Websites Logo
Go to: Gentoo Home Documentation Forums Lists Bugs Planet Store Wiki Get Gentoo!
Bug 586032 - sys-devel/gcc-5.4.0: collect2: fatal error: ld terminated with signal 9 [Killed]
Summary: sys-devel/gcc-5.4.0: collect2: fatal error: ld terminated with signal 9 [Killed]
Status: RESOLVED DUPLICATE of bug 20600
Alias: None
Product: Gentoo Linux
Classification: Unclassified
Component: [OLD] Core system (show other bugs)
Hardware: All Linux
: Normal normal (vote)
Assignee: Gentoo Toolchain Maintainers
Depends on:
Reported: 2016-06-15 16:37 UTC by Andrey Grozin
Modified: 2016-06-21 15:10 UTC (History)
0 users

See Also:
Package list:
Runtime testing required: ---

bzip2ed build log (gcc-5.4.0.log.bz2,106.61 KB, application/x-bzip2)
2016-06-15 16:37 UTC, Andrey Grozin
gcc-build-logs.tar.bz2 (gcc-build-logs.tar.bz2,248.75 KB, application/x-bzip2)
2016-06-15 16:39 UTC, Andrey Grozin

Note You need to log in before you can comment on or make changes to this bug.
Description Andrey Grozin gentoo-dev 2016-06-15 16:37:02 UTC
Created attachment 437668 [details]
bzip2ed build log

/var/tmp/portage/sys-devel/gcc-5.4.0/work/build/./prev-gcc/xg++ -B/var/tmp/portage/sys-devel/gcc-5.4.0/work/build/./prev-gcc/ -B/usr/x
86_64-pc-linux-gnu/bin/ -nostdinc++ -B/var/tmp/portage/sys-devel/gcc-5.4.0/work/build/prev-x86_64-pc-linux-gnu/libstdc++-v3/src/.libs 
-B/var/tmp/portage/sys-devel/gcc-5.4.0/work/build/prev-x86_64-pc-linux-gnu/libstdc++-v3/libsupc++/.libs  -isystem /var/tmp/portage/sys
-devel/gcc-5.4.0/work/build/prev-x86_64-pc-linux-gnu/libstdc++-v3/include/x86_64-pc-linux-gnu  -isystem /var/tmp/portage/sys-devel/gcc
-5.4.0/work/build/prev-x86_64-pc-linux-gnu/libstdc++-v3/include  -isystem /var/tmp/portage/sys-devel/gcc-5.4.0/work/gcc-5.4.0/libstdc+
+-v3/libsupc++ -L/var/tmp/portage/sys-devel/gcc-5.4.0/work/build/prev-x86_64-pc-linux-gnu/libstdc++-v3/src/.libs -L/var/tmp/portage/sy
s-devel/gcc-5.4.0/work/build/prev-x86_64-pc-linux-gnu/libstdc++-v3/libsupc++/.libs -DEFAULT_SSP      -m64 -O2 -march=native -pipe -gto
ggle -DIN_GCC    -fno-exceptions -fno-rtti -fasynchronous-unwind-tables -W -Wall -Wno-narrowing -Wwrite-strings -Wcast-qual -Wmissing-
format-attribute -Woverloaded-virtual -pedantic -Wno-long-long -Wno-variadic-macros -Wno-overlength-strings   -DHAVE_CONFIG_H -static-
libstdc++ -static-libgcc  -o cc1plus \
      cp/cp-lang.o c-family/stub-objc.o cp/call.o cp/decl.o cp/expr.o cp/pt.o cp/typeck2.o cp/class.o cp/decl2.o cp/error.o cp/lex.o c
p/parser.o cp/ptree.o cp/rtti.o cp/typeck.o cp/cvt.o cp/except.o cp/friend.o cp/init.o cp/method.o cp/search.o cp/semantics.o cp/tree.
o cp/repo.o cp/dump.o cp/optimize.o cp/mangle.o cp/cp-objcp-common.o cp/name-lookup.o cp/cxx-pretty-print.o cp/cp-cilkplus.o cp/cp-gim
plify.o cp/cp-array-notation.o cp/lambda.o cp/vtable-class-hierarchy.o cp/constexpr.o cp/cp-ubsan.o attribs.o incpath.o c-family/c-com
mon.o c-family/c-cppbuiltin.o c-family/c-dump.o c-family/c-format.o c-family/c-gimplify.o c-family/c-lex.o c-family/c-omp.o c-family/c
-opts.o c-family/c-pch.o c-family/c-ppoutput.o c-family/c-pragma.o c-family/c-pretty-print.o c-family/c-semantics.o c-family/c-ada-spe
c.o c-family/c-cilkplus.o c-family/array-notation-common.o c-family/cilk.o c-family/c-ubsan.o i386-c.o glibc-c.o cc1plus-checksum.o li
bbackend.a main.o  libcommon-target.a libcommon.a ../libcpp/libcpp.a ../libdecnumber/libdecnumber.a libcommon.a ../libcpp/libcpp.a   .
./libbacktrace/.libs/libbacktrace.a ../libiberty/libiberty.a ../libdecnumber/libdecnumber.a  -ldl -lmpc -lmpfr -lgmp -rdynamic -ldl  -
collect2: fatal error: ld terminated with signal 9 [Killed]
compilation terminated.
collect2: fatal error: ld terminated with signal 9 [Killed]
compilation terminated.
collect2: fatal error: ld terminated with signal 9 [Killed]
compilation terminated.
make[3]: *** [/var/tmp/portage/sys-devel/gcc-5.4.0/work/gcc-5.4.0/gcc/lto/ lto1] Error 1
make[3]: *** Waiting for unfinished jobs....
make[3]: *** [/var/tmp/portage/sys-devel/gcc-5.4.0/work/gcc-5.4.0/gcc/c/ cc1] Error 1
make[3]: *** [/var/tmp/portage/sys-devel/gcc-5.4.0/work/gcc-5.4.0/gcc/cp/ cc1plus] Error 1
collect2: fatal error: ld terminated with signal 9 [Killed]
compilation terminated.
make[3]: *** [/var/tmp/portage/sys-devel/gcc-5.4.0/work/gcc-5.4.0/gcc/java/ jc1] Error 1
collect2: fatal error: ld terminated with signal 9 [Killed]
compilation terminated.
make[3]: *** [/var/tmp/portage/sys-devel/gcc-5.4.0/work/gcc-5.4.0/gcc/java/ jc1] Error 1
collect2: fatal error: ld terminated with signal 9 [Killed]
compilation terminated.
make[3]: *** [/var/tmp/portage/sys-devel/gcc-5.4.0/work/gcc-5.4.0/gcc/fortran/ f951] Error 1
rm gcc.pod gfortran.pod
make[3]: Leaving directory '/var/tmp/portage/sys-devel/gcc-5.4.0/work/build/gcc'
make[2]: *** [Makefile:4409: all-stage2-gcc] Error 2
make[2]: Leaving directory '/var/tmp/portage/sys-devel/gcc-5.4.0/work/build'
make[1]: *** [Makefile:21296: stage2-bubble] Error 2
make[1]: Leaving directory '/var/tmp/portage/sys-devel/gcc-5.4.0/work/build'
make: *** [Makefile:21511: bootstrap-lean] Error 2
 * ERROR: sys-devel/gcc-5.4.0::gentoo failed (compile phase):
 *   emake failed

dns ~ # emerge --info '=sys-devel/gcc-5.4.0::gentoo'
Portage 2.3.0_rc1 (python 3.4.4-final-0, default/linux/amd64/13.0/desktop/plasma, gcc-5.3.0, glibc-2.23-r2, 4.6.2-gentoo x86_64)
                         System Settings
System uname: Linux-4.6.2-gentoo-x86_64-Intel-R-_Core-TM-_i7-3610QM_CPU_@_2.30GHz-with-gentoo-2.2
KiB Mem:     8074492 total,   1017856 free
KiB Swap:   10485756 total,  10485556 free
Timestamp of repository gentoo: Wed, 15 Jun 2016 14:45:01 +0000
sh bash 4.3_p42-r2
ld GNU ld (Gentoo 2.25.1 p1.1) 2.25.1
app-shells/bash:          4.3_p42-r2::gentoo
dev-java/java-config:     2.2.0-r3::gentoo
dev-lang/perl:            5.24.0-r1::gentoo
dev-lang/python:          2.7.11-r2::gentoo, 3.3.5-r8::gentoo, 3.4.4::gentoo, 3.5.1-r3::gentoo
dev-util/cmake:           3.5.2-r1::gentoo
dev-util/pkgconfig:       0.29.1::gentoo
sys-apps/baselayout:      2.2::gentoo
sys-apps/openrc:          0.21::gentoo
sys-apps/sandbox:         2.10-r2::gentoo
sys-devel/autoconf:       2.13::gentoo, 2.69-r2::gentoo
sys-devel/automake:       1.11.6-r2::gentoo, 1.12.6-r1::gentoo, 1.13.4-r1::gentoo, 1.14.1-r1::gentoo, 1.15-r2::gentoo
sys-devel/binutils:       2.25.1-r1::gentoo
sys-devel/gcc:            4.9.3::gentoo, 5.3.0::gentoo
sys-devel/gcc-config:     1.8-r1::gentoo
sys-devel/libtool:        2.4.6-r2::gentoo
sys-devel/make:           4.2.1::gentoo
sys-kernel/linux-headers: 4.6::gentoo (virtual/os-headers)
sys-libs/glibc:           2.23-r2::gentoo

    location: /usr/portage
    sync-type: rsync
    sync-uri: rsync://
    priority: -1000

    location: /var/lib/layman/kde
    masters: gentoo
    priority: 50

    location: /var/lib/layman/lisp
    masters: gentoo
    priority: 50

    location: /var/lib/layman/science
    masters: gentoo
    priority: 50

    location: /usr/local/portage
    masters: gentoo
    priority: 60

ACCEPT_KEYWORDS="amd64 ~amd64"
CFLAGS="-O2 -march=native -pipe"
CONFIG_PROTECT="/etc /usr/lib64/libreoffice/program/sofficerc /usr/share/config /usr/share/gnupg/qualified.txt"
CONFIG_PROTECT_MASK="/etc/ca-certificates.conf /etc/dconf /etc/env.d /etc/fonts/fonts.conf /etc/gconf /etc/gentoo-release /etc/php/apache2-php5.6/ext-active/ /etc/php/cgi-php5.6/ext-active/ /etc/php/cli-php5.6/ext-active/ /etc/revdep-rebuild /etc/sandbox.d /etc/terminfo /etc/texmf/language.dat.d /etc/texmf/language.def.d /etc/texmf/updmap.d /etc/texmf/web2c"
CXXFLAGS="-O2 -march=native -pipe"
FCFLAGS="-O2 -pipe"
FEATURES="assume-digests binpkg-logs config-protect-if-modified distlocks ebuild-locks fixlafiles merge-sync news parallel-fetch preserve-libs protect-owned sandbox sfperms strict unknown-features-warn unmerge-logs unmerge-orphans userfetch userpriv usersandbox usersync xattr"
FFLAGS="-O2 -march=native -pipe"
LDFLAGS="-Wl,-O1 -Wl,--as-needed"
PORTAGE_RSYNC_OPTS="--recursive --links --safe-links --perms --times --omit-dir-times --compress --force --whole-file --delete --stats --human-readable --timeout=180 --exclude=/distfiles --exclude=/local --exclude=/packages --exclude=/.git"
USE="X a52 aac acpi alsa amd64 bash-completion berkdb blas bluetooth boehm-gc branding browserplugin bzip2 cairo cdda cdr cli consolekit cracklib crypt css cups curl cxx dbus declarative dirac doc dri dvd emacs enca encode exif fam ffmpeg fftw firefox flac fortran gd gdbm gif glamor gmp gpm gsl gtk iconv imagemagick jpeg kde kipi kpathsea lapack latex lcms ldap libnotify lzma mad mmx mmxext mng modules mozilla mp3 mp4 mpeg multilib ncurses nls nptl nsplugin offensive ogg opengl openmp pam pango pcre pdf phonon plasma plotutils png policykit ppds python qml qt3support qt4 qt5 readline schroedinger sdl seccomp semantic-desktop session speex spell sse sse2 ssl startup-notification svg tcl tcpd theora tiff tk truetype udev udisks umfpack unicode upower usb v4l2 vorbis widgets win32codecs wxwidgets x264 xattr xcb xcomposite xinerama xml xscreensaver xv xvid zlib" ABI_X86="64" ALSA_CARDS="ali5451 als4000 atiixp atiixp-modem bt87x ca0106 cmipci emu10k1x ens1370 ens1371 es1938 es1968 fm801 hda-intel intel8x0 intel8x0m maestro3 trident usb-audio via82xx via82xx-modem ymfpci" APACHE2_MODULES="authn_core authz_core socache_shmcb unixd actions alias auth_basic authn_alias authn_anon authn_dbm authn_default authn_file authz_dbm authz_default authz_groupfile authz_host authz_owner authz_user autoindex cache cgi cgid dav dav_fs dav_lock deflate dir disk_cache env expires ext_filter file_cache filter headers include info log_config logio mem_cache mime mime_magic negotiation rewrite setenvif speling status unique_id userdir usertrack vhost_alias" CALLIGRA_FEATURES="kexi words flow plan sheets stage tables krita karbon braindump author" CAMERAS="ptp2" COLLECTD_PLUGINS="df interface irq load memory rrdtool swap syslog" CPU_FLAGS_X86="aes avx mmx mmxext popcnt sse sse2 sse3 sse4_1 sse4_2 ssse3" ELIBC="glibc" GPSD_PROTOCOLS="ashtech aivdm earthmate evermore fv18 garmin garmintxt gpsclock itrax mtk3301 nmea ntrip navcom oceanserver oldstyle oncore rtcm104v2 rtcm104v3 sirf superstar2 timing tsip tripmate tnt ublox ubx" INPUT_DEVICES="evdev synaptics" KERNEL="linux" LCD_DEVICES="bayrad cfontz cfontz633 glk hd44780 lb216 lcdm001 mtxorb ncurses text" LIBREOFFICE_EXTENSIONS="presenter-console presenter-minimizer" LINGUAS="ru en" OFFICE_IMPLEMENTATION="libreoffice" PHP_TARGETS="php5-5" PYTHON_SINGLE_TARGET="python2_7" PYTHON_TARGETS="python2_7 python3_3 python3_4 python3_5" RUBY_TARGETS="ruby21 ruby22" USERLAND="GNU" VIDEO_CARDS="intel" XTABLES_ADDONS="quota2 psd pknock lscan length2 ipv4options ipset ipp2p iface geoip fuzzy condition tee tarpit sysrq steal rawnat logmark ipmark dhcpmac delude chaos account"
USE_PYTHON="2.7 3.3"

dns ~ # emerge -pqv '=sys-devel/gcc-5.4.0::gentoo'
[ebuild  NS   ] sys-devel/gcc-5.4.0 [4.9.3, 5.3.0] USE="cxx doc fortran gcj graphite (multilib) nls nptl openmp sanitize vtv (-altivec) (-awt) -cilk -debug (-fixed-point) -go (-hardened) (-jit) (-libssp) -mpx -multislot -nopie -nossp -objc -objc++ -objc-gc -regression-test -vanilla"
Comment 1 Andrey Grozin gentoo-dev 2016-06-15 16:39:54 UTC
Created attachment 437670 [details]
Comment 2 SpanKY gentoo-dev 2016-06-15 17:26:09 UTC
look in `dmesg`.  when a tool is Killed by the kernel, it's almost always due to resource usage above what your system has to offer.
Comment 3 Andrey Grozin gentoo-dev 2016-06-21 14:08:11 UTC
Looks like some problem on my notebook.
Comment 4 SpanKY gentoo-dev 2016-06-21 15:10:47 UTC

*** This bug has been marked as a duplicate of bug 20600 ***