Gentoo Websites Logo
Go to: Gentoo Home Documentation Forums Lists Bugs Planet Store Wiki Get Gentoo!
Bug 580508 - dev-db/spatialite-4.3.0 fails tests check_gpkgMode check_gpkgVirtual
Summary: dev-db/spatialite-4.3.0 fails tests check_gpkgMode check_gpkgVirtual
Status: UNCONFIRMED
Alias: None
Product: Gentoo Linux
Classification: Unclassified
Component: [OLD] Development (show other bugs)
Hardware: All Linux
: Normal normal (vote)
Assignee: Sci-geo Project
URL:
Whiteboard:
Keywords:
Depends on:
Blocks:
 
Reported: 2016-04-19 08:30 UTC by eroen
Modified: 2017-02-19 18:50 UTC (History)
0 users

See Also:
Package list:
Runtime testing required: ---


Attachments
build.log (build.log,274.89 KB, text/plain)
2016-04-19 08:30 UTC, eroen
Details
test-suite.log (test-suite.log,745 bytes, text/plain)
2016-04-19 08:32 UTC, eroen
Details

Note You need to log in before you can comment on or make changes to this bug.
Description eroen 2016-04-19 08:30:53 UTC
Created attachment 431218 [details]
build.log

Tests check_virtualtable2 check_virtualtable3 also fail, previously reported as bug 573338.

...
FAIL: check_gpkgMode
...
FAIL: check_gpkgVirtual
============================================================================
Testsuite summary for libspatialite 4.3.0
============================================================================
# TOTAL: 84
# PASS:  80
# SKIP:  0
# XFAIL: 0
# FAIL:  4
# XPASS: 0
# ERROR: 0
============================================================================
See test/test-suite.log
Please report to a.furieri@lqt.it
============================================================================
Makefile:1708: recipe for target 'test-suite.log' failed
make[4]: *** [test-suite.log] Error 1
make[4]: Leaving directory '/var/tmp/portage/dev-db/spatialite-4.3.0/work/libspatialite-4.3.0/test'
Makefile:1814: recipe for target 'check-TESTS' failed
make[3]: *** [check-TESTS] Error 2
make[3]: Leaving directory '/var/tmp/portage/dev-db/spatialite-4.3.0/work/libspatialite-4.3.0/test'
Makefile:2493: recipe for target 'check-am' failed
make[2]: *** [check-am] Error 2
make[2]: Leaving directory '/var/tmp/portage/dev-db/spatialite-4.3.0/work/libspatialite-4.3.0/test'
Makefile:1601: recipe for target 'check-recursive' failed
make[1]: *** [check-recursive] Error 1
make[1]: Leaving directory '/var/tmp/portage/dev-db/spatialite-4.3.0/work/libspatialite-4.3.0/test'
Makefile:473: recipe for target 'check-recursive' failed
make: *** [check-recursive] Error 1
 * ERROR: dev-db/spatialite-4.3.0::gentoo failed (test phase):
 *   Make check failed. See above for details.
 * 
 * Call stack:
 *            ebuild.sh, line  133:  Called src_test
 *          environment, line 1976:  Called default
 *   phase-functions.sh, line  769:  Called default_src_test
 *   phase-functions.sh, line  798:  Called __eapi0_src_test
 *     phase-helpers.sh, line  760:  Called die
 * The specific snippet of code:
 *   		$emake_cmd ${internal_opts} check || \
 *   			die "Make check failed. See above for details."
Comment 1 eroen 2016-04-19 08:32:34 UTC
Created attachment 431220 [details]
test-suite.log

...
FAIL: check_gpkgMode
====================

Test: SELECT IsValidGPB( ShiftCoords(geom, 1.5, 2.5) ) FROM pt2d WHERE id = 3
Error: database disk image is malformed

FAIL: check_gpkgVirtual
=======================

Unexpected "id": not an INTEGER
Comment 2 eroen 2016-04-19 08:33:59 UTC
localhost ~ # emerge --info '=dev-db/spatialite-4.3.0::gentoo'
Portage 2.2.26 (python 2.7.10-final-0, default/linux/amd64/13.0, gcc-4.9.3, glibc-2.22-r4, 4.1.15-gentoo-r1 x86_64)
=================================================================
                         System Settings
=================================================================
System uname: Linux-4.1.15-gentoo-r1-x86_64-Intel-R-_Core-TM-_i5-2520M_CPU_@_2.50GHz-with-gentoo-2.2
KiB Mem:     4043252 total,   3644324 free
KiB Swap:          0 total,         0 free
Timestamp of repository gentoo: Tue, 19 Apr 2016 00:45:01 +0000
sh bash 4.3_p42-r1
ld GNU ld (Gentoo 2.25.1 p1.1) 2.25.1
app-shells/bash:          4.3_p42-r1::gentoo
dev-lang/perl:            5.20.2::gentoo
dev-lang/python:          2.7.10-r1::gentoo, 3.4.3-r1::gentoo
dev-util/pkgconfig:       0.28-r2::gentoo
sys-apps/baselayout:      2.2::gentoo
sys-apps/openrc:          0.19.1::gentoo
sys-apps/sandbox:         2.10-r1::gentoo
sys-devel/autoconf:       2.69::gentoo
sys-devel/automake:       1.14.1::gentoo, 1.15::gentoo
sys-devel/binutils:       2.25.1-r1::gentoo
sys-devel/gcc:            4.9.3::gentoo
sys-devel/gcc-config:     1.7.3::gentoo
sys-devel/libtool:        2.4.6::gentoo
sys-devel/make:           4.1-r1::gentoo
sys-kernel/linux-headers: 4.3::gentoo (virtual/os-headers)
sys-libs/glibc:           2.22-r4::gentoo
Repositories:

gentoo
    location: /usr/portage
    sync-type: rsync
    sync-uri: rsync://rsync.gentoo.org/gentoo-portage
    priority: -1000

ACCEPT_KEYWORDS="amd64"
ACCEPT_LICENSE="* -@EULA"
CBUILD="x86_64-pc-linux-gnu"
CFLAGS="-O2 -pipe"
CHOST="x86_64-pc-linux-gnu"
CONFIG_PROTECT="/etc"
CONFIG_PROTECT_MASK="/etc/ca-certificates.conf /etc/env.d /etc/gconf /etc/gentoo-release /etc/sandbox.d /etc/terminfo"
CXXFLAGS="-O2 -pipe"
DISTDIR="/usr/portage/distfiles"
FCFLAGS="-O2 -pipe"
FEATURES="assume-digests binpkg-logs config-protect-if-modified distlocks ebuild-locks fixlafiles merge-sync news parallel-fetch preserve-libs protect-owned sandbox sfperms strict unknown-features-warn unmerge-logs unmerge-orphans userfetch userpriv usersandbox usersync xattr"
FFLAGS="-O2 -pipe"
GENTOO_MIRRORS="http://distfiles.gentoo.org"
LDFLAGS="-Wl,-O1 -Wl,--as-needed"
PKGDIR="/usr/portage/packages"
PORTAGE_CONFIGROOT="/"
PORTAGE_RSYNC_OPTS="--recursive --links --safe-links --perms --times --omit-dir-times --compress --force --whole-file --delete --stats --human-readable --timeout=180 --exclude=/distfiles --exclude=/local --exclude=/packages"
PORTAGE_TMPDIR="/var/tmp"
USE="acl amd64 berkdb bindist bzip2 cli cracklib crypt cxx dri fortran gdbm iconv ipv6 mmx mmxext modules multilib ncurses nls nptl openmp pam pcre readline seccomp session sse sse2 ssl tcpd unicode xattr zlib" ABI_X86="64" ALSA_CARDS="ali5451 als4000 atiixp atiixp-modem bt87x ca0106 cmipci emu10k1x ens1370 ens1371 es1938 es1968 fm801 hda-intel intel8x0 intel8x0m maestro3 trident usb-audio via82xx via82xx-modem ymfpci" APACHE2_MODULES="authn_core authz_core socache_shmcb unixd actions alias auth_basic authn_alias authn_anon authn_dbm authn_default authn_file authz_dbm authz_default authz_groupfile authz_host authz_owner authz_user autoindex cache cgi cgid dav dav_fs dav_lock deflate dir disk_cache env expires ext_filter file_cache filter headers include info log_config logio mem_cache mime mime_magic negotiation rewrite setenvif speling status unique_id userdir usertrack vhost_alias" CALLIGRA_FEATURES="kexi words flow plan sheets stage tables krita karbon braindump author" CAMERAS="ptp2" COLLECTD_PLUGINS="df interface irq load memory rrdtool swap syslog" CPU_FLAGS_X86="mmx mmxext sse sse2" ELIBC="glibc" GPSD_PROTOCOLS="ashtech aivdm earthmate evermore fv18 garmin garmintxt gpsclock itrax mtk3301 nmea ntrip navcom oceanserver oldstyle oncore rtcm104v2 rtcm104v3 sirf superstar2 timing tsip tripmate tnt ublox ubx" INPUT_DEVICES="keyboard mouse evdev" KERNEL="linux" LCD_DEVICES="bayrad cfontz cfontz633 glk hd44780 lb216 lcdm001 mtxorb ncurses text" LIBREOFFICE_EXTENSIONS="presenter-console presenter-minimizer" OFFICE_IMPLEMENTATION="libreoffice" PHP_TARGETS="php5-5" PYTHON_SINGLE_TARGET="python2_7" PYTHON_TARGETS="python2_7 python3_4" RUBY_TARGETS="ruby20 ruby21" USERLAND="GNU" VIDEO_CARDS="fbdev glint intel mach64 mga nouveau nv r128 radeon savage sis tdfx trident vesa via vmware dummy v4l" XTABLES_ADDONS="quota2 psd pknock lscan length2 ipv4options ipset ipp2p iface geoip fuzzy condition tee tarpit sysrq steal rawnat logmark ipmark dhcpmac delude chaos account"
Unset:  CC, CPPFLAGS, CTARGET, CXX, EMERGE_DEFAULT_OPTS, INSTALL_MASK, LANG, LC_ALL, MAKEOPTS, PORTAGE_BUNZIP2_COMMAND, PORTAGE_COMPRESS, PORTAGE_COMPRESS_FLAGS, PORTAGE_RSYNC_EXTRA_OPTS, USE_PYTHON

localhost ~ # emerge -pqv '=dev-db/spatialite-4.3.0::gentoo'
[ebuild  N    ] dev-db/spatialite-4.3.0  USE="geos iconv proj xls" 

 * IMPORTANT: 9 news items need reading for repository 'gentoo'.
 * Use eselect news read to view new items.
Comment 3 Andreas Sturmlechner gentoo-dev 2017-02-19 18:50:55 UTC
I can't reproduce that test failure on an up-to-date stable system with same use flags (except existing failures with check_virtualtable2 check_virtualtable3).