Gentoo Websites Logo
Go to: Gentoo Home Documentation Forums Lists Bugs Planet Store Wiki Get Gentoo!
Bug 571644 - dev-python/html5lib-0.9999999 with dev-python/lxml-3.5.0 fails tests
Summary: dev-python/html5lib-0.9999999 with dev-python/lxml-3.5.0 fails tests
Status: RESOLVED FIXED
Alias: None
Product: Gentoo Linux
Classification: Unclassified
Component: [OLD] Development (show other bugs)
Hardware: All Linux
: Normal normal (vote)
Assignee: Python Gentoo Team
URL:
Whiteboard:
Keywords:
Depends on:
Blocks:
 
Reported: 2016-01-12 10:04 UTC by eroen
Modified: 2016-01-15 09:50 UTC (History)
1 user (show)

See Also:
Package list:
Runtime testing required: ---


Attachments
build.log (build.log,115.30 KB, text/plain)
2016-01-12 10:04 UTC, eroen
Details

Note You need to log in before you can comment on or make changes to this bug.
Description eroen 2016-01-12 10:04:28 UTC
Created attachment 422652 [details]
build.log

Tests pass with dev-python/lxml-3.4.4.


======================================================================
ERROR: html5lib.tests.test_treewalkers.test_treewalker(None, u'<!-----><font><div>hello<table>excite!<b>me!<th><i>please!</tr><!--X-->', u'| <!-- - -->\n| <html>\n|   <head>\n|   <body>\n|     <font>\n|       <div>\n|         "helloexcite!"\n|         <b>\n|           "me!"\n|         <table>\n|           <tbody>\n|             <tr>\n|               <th>\n|                 <i>\n|                   "please!"\n|             <!-- X -->', [u"Line: 1 Col: 7 Unexpected '-' after '--' found in comment.", u'Line: 1 Col: 14 Unexpected start tag (font). Expected DOCTYPE.', u'Line: 1 Col: 38 Unexpected non-space characters in table context caused voodoo mode.', u'Line: 1 Col: 41 Unexpected start tag (b) in table context caused voodoo mode.', u'Line: 1 Col: 48 Unexpected implied end tag (b) in the table phase.', u'Line: 1 Col: 48 Unexpected table cell start tag (th) in the table body phase.', u'Line: 1 Col: 63 Got table cell end tag (th) while required end tags are missing.', u'Line: 1 Col: 71 Unexpected end of file. Expected table content.'], {u'walker': <class 'html5lib.treewalkers.lxmletree.TreeWalker'>, u'builder': <class 'html5lib.treebuilders.etree_lxml.TreeBuilder'>})
----------------------------------------------------------------------
Traceback (most recent call last):
  File "/usr/lib64/python2.7/site-packages/nose/case.py", line 197, in runTest
    self.test(*self.arg)
  File "/var/tmp/portage/dev-python/html5lib-0.9999999/work/html5lib-0.9999999/html5lib/tests/test_treewalkers.py", line 184, in runTreewalkerTest
    document = p.parse(input)
  File "/var/tmp/portage/dev-python/html5lib-0.9999999/work/html5lib-0.9999999/html5lib/html5parser.py", line 236, in parse
    parseMeta=parseMeta, useChardet=useChardet)
  File "/var/tmp/portage/dev-python/html5lib-0.9999999/work/html5lib-0.9999999/html5lib/html5parser.py", line 94, in _parse
    self.mainLoop()
  File "/var/tmp/portage/dev-python/html5lib-0.9999999/work/html5lib-0.9999999/html5lib/html5parser.py", line 199, in mainLoop
    new_token = phase.processStartTag(new_token)
  File "/var/tmp/portage/dev-python/html5lib-0.9999999/work/html5lib-0.9999999/html5lib/html5parser.py", line 648, in processStartTag
    self.insertHtmlElement()
  File "/var/tmp/portage/dev-python/html5lib-0.9999999/work/html5lib-0.9999999/html5lib/html5parser.py", line 627, in insertHtmlElement
    self.tree.insertRoot(impliedTagToken("html", "StartTag"))
  File "/var/tmp/portage/dev-python/html5lib-0.9999999/work/html5lib-0.9999999/html5lib/treebuilders/etree_lxml.py", line 347, in insertRoot
    root.addprevious(etree.Comment(comment_token["data"]))
  File "src/lxml/lxml.etree.pyx", line 3017, in lxml.etree.Comment (src/lxml/lxml.etree.c:80806)
ValueError: Comment may not contain '--' or end with '-'

======================================================================
ERROR: html5lib.tests.test_treewalkers.test_treewalker(None, u'<?COM--MENT?>', u'| <!-- ?COM--MENT? -->\n| <html>\n|   <head>\n|   <body>', [u"Line: 1 Col: 1 Expected tag name. Got '?' instead. (HTML doesn't support processing instructions.)", u'Line: 1 Col: 13 Unexpected End of file. Expected DOCTYPE.'], {u'walker': <class 'html5lib.treewalkers.lxmletree.TreeWalker'>, u'builder': <class 'html5lib.treebuilders.etree_lxml.TreeBuilder'>})
----------------------------------------------------------------------
Traceback (most recent call last):
  File "/usr/lib64/python2.7/site-packages/nose/case.py", line 197, in runTest
    self.test(*self.arg)
  File "/var/tmp/portage/dev-python/html5lib-0.9999999/work/html5lib-0.9999999/html5lib/tests/test_treewalkers.py", line 184, in runTreewalkerTest
    document = p.parse(input)
  File "/var/tmp/portage/dev-python/html5lib-0.9999999/work/html5lib-0.9999999/html5lib/html5parser.py", line 236, in parse
    parseMeta=parseMeta, useChardet=useChardet)
  File "/var/tmp/portage/dev-python/html5lib-0.9999999/work/html5lib-0.9999999/html5lib/html5parser.py", line 94, in _parse
    self.mainLoop()
  File "/var/tmp/portage/dev-python/html5lib-0.9999999/work/html5lib-0.9999999/html5lib/html5parser.py", line 217, in mainLoop
    reprocess = self.phase.processEOF()
  File "/var/tmp/portage/dev-python/html5lib-0.9999999/work/html5lib-0.9999999/html5lib/html5parser.py", line 632, in processEOF
    self.insertHtmlElement()
  File "/var/tmp/portage/dev-python/html5lib-0.9999999/work/html5lib-0.9999999/html5lib/html5parser.py", line 627, in insertHtmlElement
    self.tree.insertRoot(impliedTagToken("html", "StartTag"))
  File "/var/tmp/portage/dev-python/html5lib-0.9999999/work/html5lib-0.9999999/html5lib/treebuilders/etree_lxml.py", line 347, in insertRoot
    root.addprevious(etree.Comment(comment_token["data"]))
  File "src/lxml/lxml.etree.pyx", line 3017, in lxml.etree.Comment (src/lxml/lxml.etree.c:80806)
ValueError: Comment may not contain '--' or end with '-'

======================================================================
ERROR: html5lib.tests.test_treewalkers.test_treewalker(None, u'<!COM--MENT>', u'| <!-- COM--MENT -->\n| <html>\n|   <head>\n|   <body>', [u"Line: 1 Col: 2 Expected '--' or 'DOCTYPE'. Not found.", u'Line: 1 Col: 12 Unexpected End of file. Expected DOCTYPE.'], {u'walker': <class 'html5lib.treewalkers.lxmletree.TreeWalker'>, u'builder': <class 'html5lib.treebuilders.etree_lxml.TreeBuilder'>})
----------------------------------------------------------------------
Traceback (most recent call last):
  File "/usr/lib64/python2.7/site-packages/nose/case.py", line 197, in runTest
    self.test(*self.arg)
  File "/var/tmp/portage/dev-python/html5lib-0.9999999/work/html5lib-0.9999999/html5lib/tests/test_treewalkers.py", line 184, in runTreewalkerTest
    document = p.parse(input)
  File "/var/tmp/portage/dev-python/html5lib-0.9999999/work/html5lib-0.9999999/html5lib/html5parser.py", line 236, in parse
    parseMeta=parseMeta, useChardet=useChardet)
  File "/var/tmp/portage/dev-python/html5lib-0.9999999/work/html5lib-0.9999999/html5lib/html5parser.py", line 94, in _parse
    self.mainLoop()
  File "/var/tmp/portage/dev-python/html5lib-0.9999999/work/html5lib-0.9999999/html5lib/html5parser.py", line 217, in mainLoop
    reprocess = self.phase.processEOF()
  File "/var/tmp/portage/dev-python/html5lib-0.9999999/work/html5lib-0.9999999/html5lib/html5parser.py", line 632, in processEOF
    self.insertHtmlElement()
  File "/var/tmp/portage/dev-python/html5lib-0.9999999/work/html5lib-0.9999999/html5lib/html5parser.py", line 627, in insertHtmlElement
    self.tree.insertRoot(impliedTagToken("html", "StartTag"))
  File "/var/tmp/portage/dev-python/html5lib-0.9999999/work/html5lib-0.9999999/html5lib/treebuilders/etree_lxml.py", line 347, in insertRoot
    root.addprevious(etree.Comment(comment_token["data"]))
  File "src/lxml/lxml.etree.pyx", line 3017, in lxml.etree.Comment (src/lxml/lxml.etree.c:80806)
ValueError: Comment may not contain '--' or end with '-'

<<< many more like it >>>


----------------------------------------------------------------------
Ran 25616 tests in 52.060s

FAILED (errors=10, failures=22)
 * ERROR: dev-python/html5lib-0.9999999::gentoo failed (test phase):
 *   Tests fail with python2.7
 * 
 * Call stack:
 *     ebuild.sh, line  133:  Called src_test
 *   environment, line 3566:  Called distutils-r1_src_test
 *   environment, line  929:  Called _distutils-r1_run_foreach_impl 'python_test'
 *   environment, line  283:  Called python_foreach_impl 'distutils-r1_run_phase' 'python_test'
 *   environment, line 3090:  Called multibuild_foreach_variant '_python_multibuild_wrapper' 'distutils-r1_run_phase' 'python_test'
 *   environment, line 2199:  Called _multibuild_run '_python_multibuild_wrapper' 'distutils-r1_run_phase' 'python_test'
 *   environment, line 2197:  Called _python_multibuild_wrapper 'distutils-r1_run_phase' 'python_test'
 *   environment, line  554:  Called distutils-r1_run_phase 'python_test'
 *   environment, line  862:  Called python_test
 *   environment, line 3445:  Called die
 * The specific snippet of code:
 *       nosetests || die "Tests fail with ${EPYTHON}"
Comment 1 eroen 2016-01-12 10:07:23 UTC
localhost ~ # emerge --info '=dev-python/html5lib-0.9999999::gentoo'
Portage 2.2.26 (python 3.4.3-final-0, default/linux/amd64/13.0, gcc-4.9.3, glibc-2.21-r1, 4.1.12-gentoo x86_64)
=================================================================
                         System Settings
=================================================================
System uname: Linux-4.1.12-gentoo-x86_64-Intel-R-_Core-TM-_i5-2520M_CPU_@_2.50GHz-with-gentoo-2.2
KiB Mem:     2048344 total,   1835668 free
KiB Swap:          0 total,         0 free
Timestamp of repository gentoo: Tue, 12 Jan 2016 00:45:01 +0000
sh bash 4.3_p42-r1
ld GNU ld (Gentoo 2.25.1 p1.1) 2.25.1
app-shells/bash:          4.3_p42-r1::gentoo
dev-lang/perl:            5.20.2::gentoo
dev-lang/python:          2.7.10-r1::gentoo, 3.4.3-r1::gentoo
dev-util/pkgconfig:       0.28-r2::gentoo
sys-apps/baselayout:      2.2::gentoo
sys-apps/openrc:          0.18.4::gentoo
sys-apps/sandbox:         2.6-r1::gentoo
sys-devel/autoconf:       2.69::gentoo
sys-devel/automake:       1.14.1::gentoo, 1.15::gentoo
sys-devel/binutils:       2.25.1-r1::gentoo
sys-devel/gcc:            4.9.3::gentoo
sys-devel/gcc-config:     1.7.3::gentoo
sys-devel/libtool:        2.4.6::gentoo
sys-devel/make:           4.1-r1::gentoo
sys-kernel/linux-headers: 3.18::gentoo (virtual/os-headers)
sys-libs/glibc:           2.21-r1::gentoo
Repositories:

gentoo
    location: /usr/portage
    sync-type: rsync
    sync-uri: rsync://rsync.gentoo.org/gentoo-portage
    priority: -1000

ACCEPT_KEYWORDS="amd64"
ACCEPT_LICENSE="* -@EULA"
CBUILD="x86_64-pc-linux-gnu"
CFLAGS="-O2 -pipe"
CHOST="x86_64-pc-linux-gnu"
CONFIG_PROTECT="/etc"
CONFIG_PROTECT_MASK="/etc/ca-certificates.conf /etc/env.d /etc/gconf /etc/gentoo-release /etc/sandbox.d /etc/terminfo"
CXXFLAGS="-O2 -pipe"
DISTDIR="/usr/portage/distfiles"
FCFLAGS="-O2 -pipe"
FEATURES="assume-digests binpkg-logs config-protect-if-modified distlocks ebuild-locks fixlafiles merge-sync news parallel-fetch preserve-libs protect-owned sandbox sfperms strict unknown-features-warn unmerge-logs unmerge-orphans userfetch userpriv usersandbox usersync xattr"
FFLAGS="-O2 -pipe"
GENTOO_MIRRORS="http://distfiles.gentoo.org"
LDFLAGS="-Wl,-O1 -Wl,--as-needed"
PKGDIR="/usr/portage/packages"
PORTAGE_CONFIGROOT="/"
PORTAGE_RSYNC_OPTS="--recursive --links --safe-links --perms --times --omit-dir-times --compress --force --whole-file --delete --stats --human-readable --timeout=180 --exclude=/distfiles --exclude=/local --exclude=/packages"
PORTAGE_TMPDIR="/var/tmp"
USE="acl amd64 berkdb bindist bzip2 cli cracklib crypt cxx dri fortran gdbm iconv ipv6 mmx mmxext modules multilib ncurses nls nptl openmp pam pcre readline seccomp session sse sse2 ssl tcpd unicode xattr zlib" ABI_X86="64" ALSA_CARDS="ali5451 als4000 atiixp atiixp-modem bt87x ca0106 cmipci emu10k1x ens1370 ens1371 es1938 es1968 fm801 hda-intel intel8x0 intel8x0m maestro3 trident usb-audio via82xx via82xx-modem ymfpci" APACHE2_MODULES="authn_core authz_core socache_shmcb unixd actions alias auth_basic authn_alias authn_anon authn_dbm authn_default authn_file authz_dbm authz_default authz_groupfile authz_host authz_owner authz_user autoindex cache cgi cgid dav dav_fs dav_lock deflate dir disk_cache env expires ext_filter file_cache filter headers include info log_config logio mem_cache mime mime_magic negotiation rewrite setenvif speling status unique_id userdir usertrack vhost_alias" CALLIGRA_FEATURES="kexi words flow plan sheets stage tables krita karbon braindump author" CAMERAS="ptp2" COLLECTD_PLUGINS="df interface irq load memory rrdtool swap syslog" CPU_FLAGS_X86="mmx mmxext sse sse2" ELIBC="glibc" GPSD_PROTOCOLS="ashtech aivdm earthmate evermore fv18 garmin garmintxt gpsclock itrax mtk3301 nmea ntrip navcom oceanserver oldstyle oncore rtcm104v2 rtcm104v3 sirf superstar2 timing tsip tripmate tnt ublox ubx" INPUT_DEVICES="keyboard mouse evdev" KERNEL="linux" LCD_DEVICES="bayrad cfontz cfontz633 glk hd44780 lb216 lcdm001 mtxorb ncurses text" LIBREOFFICE_EXTENSIONS="presenter-console presenter-minimizer" OFFICE_IMPLEMENTATION="libreoffice" PHP_TARGETS="php5-5" PYTHON_SINGLE_TARGET="python2_7" PYTHON_TARGETS="python2_7 python3_4" RUBY_TARGETS="ruby20 ruby21" USERLAND="GNU" VIDEO_CARDS="fbdev glint intel mach64 mga nouveau nv r128 radeon savage sis tdfx trident vesa via vmware dummy v4l" XTABLES_ADDONS="quota2 psd pknock lscan length2 ipv4options ipset ipp2p iface geoip fuzzy condition tee tarpit sysrq steal rawnat logmark ipmark dhcpmac delude chaos account"
Unset:  CC, CPPFLAGS, CTARGET, CXX, EMERGE_DEFAULT_OPTS, INSTALL_MASK, LANG, LC_ALL, MAKEOPTS, PORTAGE_BUNZIP2_COMMAND, PORTAGE_COMPRESS, PORTAGE_COMPRESS_FLAGS, PORTAGE_RSYNC_EXTRA_OPTS, USE_PYTHON

localhost ~ # emerge -pqv '=dev-python/html5lib-0.9999999::gentoo'
[ebuild  N    ] dev-python/html5lib-0.9999999  USE="{test}" PYTHON_TARGETS="python2_7 python3_4 -pypy -pypy3 -python3_3 -python3_5" 

 * IMPORTANT: 9 news items need reading for repository 'gentoo'.
 * Use eselect news read to view new items.
Comment 2 Justin Lecher gentoo-dev 2016-01-15 09:50:59 UTC
commit ae7e7778f714c55daa1c602ead4714631d55fb2a
Author: Justin Lecher <jlec@gentoo.org>
Date:   Fri Jan 15 09:50:26 2016 +0100

    dev-python/html5lib: Don't test with dev-python/lxml-3.5.0

    Gentoo-Bug: https://bugs.gentoo.org/show_bug.cgi?id=571644
    https://github.com/html5lib/html5lib-python/issues/224

    Package-Manager: portage-2.2.26
    Signed-off-by: Justin Lecher <jlec@gentoo.org>

    https://gitweb.gentoo.org/repo/gentoo.git/commit/?id=ae7e7778f714c55daa1c602ead4714631d55fb2a