Gentoo Websites Logo
Go to: Gentoo Home Documentation Forums Lists Bugs Planet Store Wiki Get Gentoo!
Bug 570042 - dev-qt/qtwebkit-4.10.4 fails to build
Summary: dev-qt/qtwebkit-4.10.4 fails to build
Alias: None
Product: Gentoo Linux
Classification: Unclassified
Component: [OLD] Development (show other bugs)
Hardware: All Linux
: Normal normal (vote)
Assignee: Qt Bug Alias
Depends on:
Blocks: gcc-5
  Show dependency tree
Reported: 2015-12-28 22:28 UTC by Chris Smith
Modified: 2016-01-20 07:14 UTC (History)
0 users

See Also:
Package list:
Runtime testing required: ---

build log (qtwebkit-4.10.4.log.xz,26.53 KB, application/x-xz)
2015-12-28 22:30 UTC, Chris Smith

Note You need to log in before you can comment on or make changes to this bug.
Description Chris Smith 2015-12-28 22:28:55 UTC
dev-qt/qtwebkit-4.10.4 fails to build - might be gcc-5.3.0 related

Reproducible: Always

Actual Results:  
x86_64-pc-linux-gnu-g++ -m32 -Wl,-O1 -Wl,--as-needed -Wl,-rpath,/var/tmp/portage/dev-qt/qtwebkit-4.10.4/work/build-abi_x86_32.x86/Release/lib -o ../../bin/jsc obj/release/jsc.o    -L/var/tmp/portage/dev-qt/qtwebkit-4.10.4/work/build-abi_x86_32.x86/Release/Source/JavaScriptCore/release -L/var/tmp/portage/dev-qt/qtwebkit-4.10.4/work/build-abi_x86_32.x86/Release/Source/WTF/release -L/usr/lib32/qt4 -Wl,-whole-archive -lJavaScriptCore -Wl,-no-whole-archive -Wl,-whole-archive -lWTF -Wl,-no-whole-archive -lQtCore -L/usr/lib32/qt4 -lpthread 
/var/tmp/portage/dev-qt/qtwebkit-4.10.4/work/build-abi_x86_32.x86/Release/Source/JavaScriptCore/release/libJavaScriptCore.a(JSArray.o): In function `.L2225':
JSArray.cpp:(.text+0x35df): undefined reference to `void JSC::JSObject::putByIndexBeyondVectorLengthWithoutAttributes<(unsigned char)20>(JSC::ExecState*, unsigned int, JSC::JSValue)'
collect2: error: ld returned 1 exit status
Makefile.jsc:120: recipe for target '../../bin/jsc' failed
make[3]: *** [../../bin/jsc] Error 1
make[3]: Leaving directory '/var/tmp/portage/dev-qt/qtwebkit-4.10.4/work/build-abi_x86_32.x86/Release/Source/JavaScriptCore'
Makefile.JavaScriptCore:142: recipe for target 'sub-jsc-pro-make_default-ordered' failed
make[2]: *** [sub-jsc-pro-make_default-ordered] Error 2
make[2]: Leaving directory '/var/tmp/portage/dev-qt/qtwebkit-4.10.4/work/build-abi_x86_32.x86/Release/Source/JavaScriptCore'
Makefile:81: recipe for target 'sub-Source-JavaScriptCore-JavaScriptCore-pro-make_default-ordered' failed
make[1]: *** [sub-Source-JavaScriptCore-JavaScriptCore-pro-make_default-ordered] Error 2
make[1]: Leaving directory '/var/tmp/portage/dev-qt/qtwebkit-4.10.4/work/build-abi_x86_32.x86/Release'
Makefile:410: recipe for target 'incremental' failed
make: *** [incremental] Error 2
 * ERROR: dev-qt/qtwebkit-4.10.4::gentoo failed (compile phase):
 *   (no error message)
 * Call stack:
 *, line  133:  Called src_compile
 *   environment, line 3533:  Called multilib-minimal_src_compile
 *   environment, line 2005:  Called multilib_foreach_abi 'multilib-minimal_abi_src_compile'
 *   environment, line 2236:  Called multibuild_foreach_variant '_multilib_multibuild_wrapper' 'multilib-minimal_abi_src_compile'
 *   environment, line 1940:  Called _multibuild_run '_multilib_multibuild_wrapper' 'multilib-minimal_abi_src_compile'
 *   environment, line 1938:  Called _multilib_multibuild_wrapper 'multilib-minimal_abi_src_compile'
 *   environment, line  390:  Called multilib-minimal_abi_src_compile
 *   environment, line 1999:  Called multilib_src_compile
 *   environment, line 2451:  Called die
 * The specific snippet of code:
 *       "${myconf[@]}" || die

emerge --info '=dev-qt/qtwebkit-4.10.4::gentoo'
Portage 2.2.26 (python 2.7.11-final-0, default/linux/amd64/13.0/desktop/plasma/systemd, gcc-5.3.0, glibc-2.22-r1, 4.3.3-gentoo x86_64)
                         System Settings
System uname: Linux-4.3.3-gentoo-x86_64-Intel-R-_Core-TM-_i7-3770K_CPU_@_3.50GHz-with-gentoo-2.2
KiB Mem:    32896612 total,  24693732 free
KiB Swap:    6291452 total,   6291452 free
Timestamp of repository gentoo: Mon, 28 Dec 2015 20:45:02 +0000
sh bash 4.3_p42
ld GNU ld (Gentoo 2.25.1 p1.1) 2.25.1
app-shells/bash:          4.3_p42::gentoo
dev-java/java-config:     2.2.0::gentoo
dev-lang/perl:            5.22.1::gentoo
dev-lang/python:          2.7.11-r1::gentoo, 3.4.3-r7::gentoo
dev-util/cmake:           3.4.1::gentoo
dev-util/pkgconfig:       0.29::gentoo
sys-apps/baselayout:      2.2::gentoo
sys-apps/openrc:          0.19.1::gentoo
sys-apps/sandbox:         2.10-r1::gentoo
sys-devel/autoconf:       2.13::gentoo, 2.69-r1::gentoo
sys-devel/automake:       1.11.6-r2::gentoo, 1.12.6-r1::gentoo, 1.13.4-r1::gentoo, 1.14.1-r1::gentoo, 1.15-r1::gentoo
sys-devel/binutils:       2.25.1-r1::gentoo
sys-devel/gcc:            4.9.3::gentoo, 5.3.0::gentoo
sys-devel/gcc-config:     1.8::gentoo
sys-devel/libtool:        2.4.6-r1::gentoo
sys-devel/make:           4.1-r1::gentoo
sys-kernel/linux-headers: 4.3::gentoo (virtual/os-headers)
sys-libs/glibc:           2.22-r1::gentoo

    location: /usr/portage
    sync-type: rsync
    sync-uri: rsync://
    priority: -1000

ACCEPT_KEYWORDS="amd64 ~amd64"
CFLAGS="-O2 -march=native -fomit-frame-pointer -pipe"
CONFIG_PROTECT="/etc /usr/share/config /usr/share/gnupg/qualified.txt"
CONFIG_PROTECT_MASK="/etc/ca-certificates.conf /etc/dconf /etc/env.d /etc/fonts/fonts.conf /etc/gconf /etc/gentoo-release /etc/revdep-rebuild /etc/sandbox.d /etc/terminfo"
CXXFLAGS="-O2 -march=native -fomit-frame-pointer -pipe"
EMERGE_DEFAULT_OPTS="--with-bdeps y"
FCFLAGS="-O2 -pipe"
FEATURES="assume-digests binpkg-logs config-protect-if-modified distlocks ebuild-locks fixlafiles merge-sync news parallel-fetch preserve-libs protect-owned sandbox sfperms strict unknown-features-warn unmerge-logs unmerge-orphans userfetch userpriv usersandbox usersync xattr"
FFLAGS="-O2 -pipe"
LDFLAGS="-Wl,-O1 -Wl,--as-needed"
MAKEOPTS="V=1 -j1"
PORTAGE_RSYNC_OPTS="--recursive --links --safe-links --perms --times --omit-dir-times --compress --force --whole-file --delete --stats --human-readable --timeout=180 --exclude=/distfiles --exclude=/local --exclude=/packages"
USE="X a52 aac aalib acl acpi aes alsa amd64 amr apache2 audiofile avahi avx bash-completion berkdb bluray branding btrfs bzip2 cairo caps cdaudio cdda cddb cdparanoia cdr cdrdao chm cleartype cli corefonts cracklib crypt cups curl cxx dbus declarative designer-plugin djvu dri dts dv dvb dvd dvdr ebook emboss encode exif fam fdk ffmpeg firefox flac fortran gdbm gif glamor gmp google gphoto2 gpm gstreamer gtk gtk3 iconv icu ieee1394 imagemagick imap imlib introspection ipv6 jack java jpeg jpeg2k kde kipi kpathsea lame lash lcms libffi libnotify lzma mad marble midi mmap mmx mmxext mng modules mozilla mp3 mp4 mpeg mtp multilib musicbrainz ncurses network nls nodrm nptl nsplugin nvidia ofx ogg opencl openexr opengl openmp pam pango pcre pdf phonon plasma png policykit popcnt ppds pulseaudio qml qt3support qt4 qt5 readline rtmp sasl scanner sdl seccomp semantic-desktop session slp smp sndfile spell sse sse2 sse3 sse4_1 sse4_2 ssl ssse3 startup-notification subversion svg systemd theora threads tiff tk transparency truetype type1 udev udisks unicode unwind upower usb v4l vaapi vcd vdpau vim-syntax vorbis vpx wav wavpack wayland widgets wmf wxwidgets x264 xattr xcb xcomposite xine xinerama xkb xml xscreensaver xv xvid xvmc zlib" ABI_X86="64 32" ALSA_CARDS="hda-intel hdsp hpet hrtimer rtctimer seqdummy virmidi" APACHE2_MODULES="authn_core authz_core socache_shmcb unixd actions alias auth_basic authn_alias authn_anon authn_dbm authn_default authn_file authz_dbm authz_default authz_groupfile authz_host authz_owner authz_user autoindex cache cgi cgid dav dav_fs dav_lock deflate dir disk_cache env expires ext_filter file_cache filter headers include info log_config logio mem_cache mime mime_magic negotiation rewrite setenvif speling status unique_id userdir usertrack vhost_alias" CALLIGRA_FEATURES="author braindump flow karbon kexi krita sheets stage words" CAMERAS="*" COLLECTD_PLUGINS="df interface irq load memory rrdtool swap syslog" CPU_FLAGS_X86="aes avx mmx mmxext popcnt sse sse2 sse3 sse4_1 sse4_2 ssse3" ELIBC="glibc" GPSD_PROTOCOLS="ashtech aivdm earthmate evermore fv18 garmin garmintxt gpsclock itrax mtk3301 nmea ntrip navcom oceanserver oldstyle oncore rtcm104v2 rtcm104v3 sirf superstar2 timing tsip tripmate tnt ublox ubx" GRUB_PLATFORMS="efi-64 pc" INPUT_DEVICES="keyboard mouse evdev" KERNEL="linux" LCD_DEVICES="bayrad cfontz cfontz633 glk hd44780 lb216 lcdm001 mtxorb ncurses text" LIBREOFFICE_EXTENSIONS="presenter-console presenter-minimizer" LINGUAS="en_US en" NGINX_MODULES_HTTP="autoindex fancyindex fastcgi gzip" OFFICE_IMPLEMENTATION="libreoffice" PHP_TARGETS="php5-5" PYTHON_SINGLE_TARGET="python2_7" PYTHON_TARGETS="python2_7 python3_4" QEMU_SOFTMMU_TARGETS="i386 x86_64" QEMU_USER_TARGETS="i386 x86_64" RUBY_TARGETS="ruby20 ruby21 ruby22 ruby23" SANE_BACKENDS="epson epson2" USERLAND="GNU" VIDEO_CARDS="nvidia nouveau intel modesetting" XTABLES_ADDONS="quota2 psd pknock lscan length2 ipv4options ipset ipp2p iface geoip fuzzy condition tee tarpit sysrq steal rawnat logmark ipmark dhcpmac delude chaos account"

                        Package Settings

dev-qt/qtwebkit-4.10.4::gentoo was built with the following:
USE="gstreamer -debug" ABI_X86="32 64 -x32"
Comment 1 Chris Smith 2015-12-28 22:30:37 UTC
Created attachment 421030 [details]
build log
Comment 2 Chris Smith 2015-12-28 22:31:59 UTC
# emerge -pqv '=dev-qt/qtwebkit-4.10.4::gentoo'
[ebuild   R   ] dev-qt/qtwebkit-4.10.4  USE="gstreamer -debug" ABI_X86="32 (64) (-x32)
Comment 3 Michael Palimaka (kensington) gentoo-dev 2016-01-20 07:13:23 UTC
Thanks, fixed in git by Andreas.