Gentoo Websites Logo
Go to: Gentoo Home Documentation Forums Lists Bugs Planet Store Wiki Get Gentoo!
Bug 558604 - >=sys-devel/llvm-3.7.0_rc2: fails JIT tests on multilib 32bit
Summary: >=sys-devel/llvm-3.7.0_rc2: fails JIT tests on multilib 32bit
Alias: None
Product: Gentoo Linux
Classification: Unclassified
Component: [OLD] Core system (show other bugs)
Hardware: All Linux
: Normal normal (vote)
Assignee: LLVM support project
Depends on:
Reported: 2015-08-24 15:07 UTC by Bernard Cafarelli
Modified: 2018-03-29 07:54 UTC (History)
5 users (show)

See Also:
Package list:
Runtime testing required: ---

llvm-3.7.0-r4:20151221-115809.log.gz (llvm-3.7.0-r4:20151221-115809.log.gz,281.82 KB, application/gzip)
2015-12-21 14:27 UTC, Paolo Pedroni

Note You need to log in before you can comment on or make changes to this bug.
Description Bernard Cafarelli gentoo-dev 2015-08-24 15:07:34 UTC
Tracking the remaining test failures

FAIL: LLVM :: ExecutionEngine/OrcLazy/anonymous_globals.ll (7644 of 14086)
******************** TEST 'LLVM :: ExecutionEngine/OrcLazy/anonymous_globals.ll' FAILED ********************
/var/tmp/portage/sys-devel/llvm-3.7.0_rc2/work/llvm-3.7.0rc2.src-abi_x86_32.x86/./bin/lli -jit-kind=orc-lazy /var/tmp/portage/sys-devel/llvm-3.7.0_rc2/work/llvm-3.7.0rc2.src/test/ExecutionEngine/OrcLazy/anonymous_globals.ll
Exit Code: 1

Command Output (stderr):
No callback manager available for target 'i686-pc-linux-gnu'.


Testing: 0 .. 10.. 20.. 30.. 40.. 50
FAIL: LLVM :: ExecutionEngine/OrcLazy/hello.ll (7645 of 14086)
******************** TEST 'LLVM :: ExecutionEngine/OrcLazy/hello.ll' FAILED ********************
/var/tmp/portage/sys-devel/llvm-3.7.0_rc2/work/llvm-3.7.0rc2.src-abi_x86_32.x86/./bin/lli -jit-kind=orc-lazy -orc-lazy-debug=funcs-to-stdout /var/tmp/portage/sys-devel/llvm-3.7.0_rc2/work/llvm-3.7.0rc2.src/test/ExecutionEngine/OrcLazy/hello.ll | /var/tmp/portage/sys-devel/llvm-3.7.0_rc2/work/llvm-3.7.0rc2.src-abi_x86_32.x86/./bin/FileCheck /var/tmp/portage/sys-devel/llvm-3.7.0_rc2/work/llvm-3.7.0rc2.src/test/ExecutionEngine/OrcLazy/hello.ll
Exit Code: 2

Command Output (stderr):
No callback manager available for target 'i686-pc-linux-gnu'.
FileCheck error: '-' is empty.


Testing: 0 .. 10.. 20.. 30.. 40.. 50
FAIL: LLVM :: ExecutionEngine/OrcLazy/private_linkage.ll (7647 of 14086)
******************** TEST 'LLVM :: ExecutionEngine/OrcLazy/private_linkage.ll' FAILED ********************
/var/tmp/portage/sys-devel/llvm-3.7.0_rc2/work/llvm-3.7.0rc2.src-abi_x86_32.x86/./bin/lli -jit-kind=orc-lazy /var/tmp/portage/sys-devel/llvm-3.7.0_rc2/work/llvm-3.7.0rc2.src/test/ExecutionEngine/OrcLazy/private_linkage.ll
Exit Code: 1

Command Output (stderr):
No callback manager available for target 'i686-pc-linux-gnu'.


Testing: 0 .. 10.. 20.. 30.. 40.. 50.. 60.. 70.. 80.. 90..
Testing Time: 37.55s
Failing Tests (3):
    LLVM :: ExecutionEngine/OrcLazy/anonymous_globals.ll
    LLVM :: ExecutionEngine/OrcLazy/hello.ll
    LLVM :: ExecutionEngine/OrcLazy/private_linkage.ll

The same test work fine for abi_x86_64.amd64
Comment 1 Bernard Cafarelli gentoo-dev 2015-08-25 19:49:08 UTC
rc3 and -9999 also have the problem
Comment 2 Paolo Pedroni 2015-12-21 14:26:08 UTC
Same problem in sys-devel/llvm-3.7.0-r4

$ Portage 2.2.24 (python 2.7.10-final-0, default/linux/amd64/13.0/desktop/plasma/systemd, gcc-4.9.3, glibc-2.21-r1, 4.1.12-gentoo x86_64)
                         System Settings
System uname: Linux-4.1.12-gentoo-x86_64-Intel-R-_Core-TM-_i7-2600_CPU_@_3.40GHz-with-gentoo-2.2
KiB Mem:    16125308 total,   6613740 free
KiB Swap:    8171516 total,   8170796 free
Timestamp of repository gentoo: Mon, 21 Dec 2015 08:15:02 +0000
sh dash
ld GNU gold (Gentoo 2.25.1 p1.1 2.25.1) 1.11
distcc 3.2rc1 x86_64-pc-linux-gnu [enabled]
ccache version 3.1.9 [disabled]
app-shells/bash:          4.3_p39::gentoo
dev-java/java-config:     2.2.0::gentoo
dev-lang/perl:            5.22.1::gentoo
dev-lang/python:          2.7.10-r1::gentoo, 3.4.3::gentoo
dev-util/ccache:          3.1.9-r4::gentoo
dev-util/cmake:           3.3.1-r1::gentoo
dev-util/pkgconfig:       0.28-r2::gentoo
sys-apps/baselayout:      2.2::gentoo
sys-apps/sandbox:         2.6-r1::gentoo
sys-devel/autoconf:       2.13::gentoo, 2.69::gentoo
sys-devel/automake:       1.11.6-r1::gentoo, 1.14.1::gentoo, 1.15::gentoo
sys-devel/binutils:       2.25.1-r1::gentoo
sys-devel/gcc:            4.9.3::gentoo
sys-devel/gcc-config:     1.8-r1::gentoo
sys-devel/libtool:        2.4.6-r1::gentoo
sys-devel/make:           4.1-r1::gentoo
sys-kernel/linux-headers: 3.18::gentoo (virtual/os-headers)
sys-libs/glibc:           2.21-r1::gentoo

    location: /usr/portage
    sync-type: rsync
    sync-uri: rsync://
    priority: -1000

    location: /var/lib/layman/kde
    sync-type: git
    sync-uri: git://
    masters: gentoo kde
    priority: 0

    location: /usr/local/portage
    masters: gentoo
    priority: 1

CFLAGS="-O2 -pipe -march=sandybridge -msahf --param l1-cache-size=32 --param l1-cache-line-size=64 --param l2-cache-size=8192 -flto=8 -fuse-linker-plugin -floop-interchange -floop-strip-mine -floop-block -fgraphite-identity"
CONFIG_PROTECT="/etc /usr/lib64/libreoffice/program/sofficerc /usr/share/config /usr/share/gnupg/qualified.txt /var/lib/hsqldb"
CONFIG_PROTECT_MASK="/etc/ca-certificates.conf /etc/dconf /etc/env.d /etc/fonts/fonts.conf /etc/gconf /etc/gentoo-release /etc/php/apache2-php5.6/ext-active/ /etc/php/cgi-php5.6/ext-active/ /etc/php/cli-php5.6/ext-active/ /etc/revdep-rebuild /etc/sandbox.d /etc/terminfo"
CXXFLAGS="-O2 -pipe -march=sandybridge -msahf --param l1-cache-size=32 --param l1-cache-line-size=64 --param l2-cache-size=8192 -flto=8 -fuse-linker-plugin -floop-interchange -floop-strip-mine -floop-block -fgraphite-identity"
EMERGE_DEFAULT_OPTS="--keep-going y --with-bdeps y"
FCFLAGS="-O2 -pipe"
FEATURES="assume-digests binpkg-logs cgroup compress-build-logs config-protect-if-modified distcc distlocks ebuild-locks ipc-sandbox merge-sync news parallel-fetch protect-owned sandbox sfperms split-elog split-log strict test unknown-features-warn unmerge-logs unmerge-orphans userfetch userpriv usersandbox usersync xattr"
FFLAGS="-O2 -pipe"
LDFLAGS="-Wl,-O1 -Wl,--as-needed -Wl,--hash-style=gnu -Wl,--sort-common -flto=8 -fuse-linker-plugin -floop-interchange -floop-strip-mine -floop-block -fgraphite-identity"
MAKEOPTS="-j11 -l8"
PORTAGE_RSYNC_OPTS="--recursive --links --safe-links --perms --times --omit-dir-times --compress --force --whole-file --delete --stats --human-readable --timeout=180 --exclude=/distfiles --exclude=/local --exclude=/packages"
USE="X a52 aac aalib acl acpi adns alsa amd64 ao audiofile bash-completion bluetooth branding bzip2 cairo caps cdda cddb cdparanoia cdr cli cracklib crypt css cups curl cxx dbus declarative dga djvu dri dts dvd dvdr emboss encode exif expat fbcon ffmpeg fftw firefox flac fontconfig foomaticdb fortran ftp gd gdbm geoip gif gimp glamor gmp gnutls gphoto2 gpm graphviz gtk handbook iconv icu idn imagemagick imlib ipv6 java javascript jbig jpeg jpeg2k kde kipi lame lcms libass libcaca libnotify libsamplerate lm_sensors lua lzma lzo mad mmap mmx mmxext mng modules mp3 mp4 mpeg mplayer multilib musicbrainz ncurses nls nptl nsplugin offensive ogg openal openexr opengl openmp pam pango pcre pdf phonon plasma png policykit postscript ppds pulseaudio qml qt3support qt4 qt5 rdesktop readline recode samba sctp sdl seccomp semantic-desktop session sndfile sockets speex spell sqlite sse sse2 ssl startup-notification subversion svg symlink syslog systemd sysvipc taglib theora threads tidy tiff truetype udev udisks unicode upower usb vaapi vcd vim-syntax vnc vorbis wayland widgets win32codecs wmf wxwidgets x264 xattr xcb xcomposite xine xinerama xml xpm xscreensaver xv xvid yahoo zlib" ABI_X86="64" ALSA_CARDS="hda-intel virmidi" APACHE2_MODULES="authn_core authz_core socache_shmcb unixd actions alias auth_basic authn_alias authn_anon authn_dbm authn_default authn_file authz_dbm authz_default authz_groupfile authz_host authz_owner authz_user autoindex cache cgi cgid dav dav_fs dav_lock deflate dir disk_cache env expires ext_filter file_cache filter headers include info log_config logio mem_cache mime mime_magic negotiation rewrite setenvif speling status unique_id userdir usertrack vhost_alias" CALLIGRA_FEATURES="kexi words flow plan sheets stage tables krita karbon braindump author" CAMERAS="kodak ptp2" COLLECTD_PLUGINS="df interface irq load memory rrdtool swap syslog" CPU_FLAGS_X86="aes avx mmx mmxext popcnt sse sse2 sse3 sse4_1 sse4_2 ssse3" ELIBC="glibc" GPSD_PROTOCOLS="ashtech aivdm earthmate evermore fv18 garmin garmintxt gpsclock itrax mtk3301 nmea ntrip navcom oceanserver oldstyle oncore rtcm104v2 rtcm104v3 sirf superstar2 timing tsip tripmate tnt ublox ubx" GRUB_PLATFORMS="pc" INPUT_DEVICES="evdev" KERNEL="linux" LCD_DEVICES="bayrad cfontz cfontz633 glk hd44780 lb216 lcdm001 mtxorb ncurses text" LIBREOFFICE_EXTENSIONS="nlpsolver" LINGUAS="it" OFFICE_IMPLEMENTATION="libreoffice" PHP_TARGETS="php5-5" PYTHON_SINGLE_TARGET="python2_7" PYTHON_TARGETS="python2_7 python3_4 pypy pypy3" RUBY_TARGETS="ruby21" USERLAND="GNU" VIDEO_CARDS="intel i965" XTABLES_ADDONS="quota2 psd pknock lscan length2 ipv4options ipset ipp2p iface geoip fuzzy condition tee tarpit sysrq steal rawnat logmark ipmark dhcpmac delude chaos account"

$ emerge -1pqv --nodeps =sys-devel/llvm-3.7.0-r4
[ebuild     U ] sys-devel/llvm-3.7.0-r4 [3.5.2] USE="clang gold libffi ncurses static-analyzer {test} xml -debug -doc -libedit -lldb% -multitarget -ocaml -python" ABI_X86="32 (64) (-x32)" PYTHON_TARGETS="python2_7 (-pypy%*)" VIDEO_CARDS="-radeon"
Comment 3 Paolo Pedroni 2015-12-21 14:27:02 UTC
Created attachment 420034 [details]
Comment 4 eroen 2016-05-22 20:30:10 UTC
With sys-devel/llvm-3.8.0-r2, I see the tests in comment 0 plus ExecutionEngine/OrcLazy/global_aliases.ll fail.

FAIL: LLVM :: ExecutionEngine/OrcLazy/global_aliases.ll (8345 of 15520)
******************** TEST 'LLVM :: ExecutionEngine/OrcLazy/global_aliases.ll' FAILED ********************
/var/tmp/portage/sys-devel/llvm-3.8.0-r2/work/llvm-3.8.0.src-abi_x86_32.x86/./bin/lli -jit-kind=orc-lazy /var/tmp/portage/sys-devel/llvm-3.8.0-r2/work/llvm-3.8.0.src/test/ExecutionEngine/OrcLazy/global_aliases.ll
Exit Code: 1

Command Output (stderr):
No callback manager available for target 'i686-pc-linux-gnu'.

Failing Tests (4):
    LLVM :: ExecutionEngine/OrcLazy/anonymous_globals.ll
    LLVM :: ExecutionEngine/OrcLazy/global_aliases.ll
    LLVM :: ExecutionEngine/OrcLazy/hello.ll
    LLVM :: ExecutionEngine/OrcLazy/private_linkage.ll

  Expected Passes    : 9728
  Expected Failures  : 61
  Unsupported Tests  : 5727
  Unexpected Failures: 4
FAILED: cd /var/tmp/portage/sys-devel/llvm-3.8.0-r2/work/llvm-3.8.0.src-abi_x86_32.x86/test && /var/tmp/portage/sys-devel/llvm-3.8.0-r2/temp/python2.7/bin/python /var/tmp/portage/sys-devel/llvm-3.8.0-r2/work/llvm-3.8.0.src/utils/lit/ -sv --param llvm_site_config=/var/tmp/portage/sys-devel/llvm-3.8.0-r2/work/llvm-3.8.0.src-abi_x86_32.x86/test/ --param llvm_unit_site_config=/var/tmp/portage/sys-devel/llvm-3.8.0-r2/work/llvm-3.8.0.src-abi_x86_32.x86/test/Unit/ /var/tmp/portage/sys-devel/llvm-3.8.0-r2/work/llvm-3.8.0.src-abi_x86_32.x86/test
ninja: build stopped: subcommand failed.
 * ERROR: sys-devel/llvm-3.8.0-r2::gentoo failed (test phase):
 *   (no error message)
Comment 5 Michał Górny archtester Gentoo Infrastructure gentoo-dev Security 2018-03-29 07:54:25 UTC
This version is no longer supported, and the tests in 4+ versions should pass.