Gentoo Websites Logo
Go to: Gentoo Home Documentation Forums Lists Bugs Planet Store Wiki Get Gentoo!
Bug 520332 - =net-misc/radvd-2.3 fails tests - Assertion 'sizeof(expected)==sb.used' failed: sizeof(expected)==24, sb.used==56
Summary: =net-misc/radvd-2.3 fails tests - Assertion 'sizeof(expected)==sb.used' faile...
Status: RESOLVED TEST-REQUEST
Alias: None
Product: Gentoo Linux
Classification: Unclassified
Component: Current packages (show other bugs)
Hardware: All Linux
: Normal normal (vote)
Assignee: Michael Weber (RETIRED)
URL:
Whiteboard:
Keywords: TESTFAILURE
Depends on:
Blocks:
 
Reported: 2014-08-20 16:04 UTC by eroen
Modified: 2014-08-22 17:20 UTC (History)
1 user (show)

See Also:
Package list:
Runtime testing required: ---


Attachments
net-misc:radvd-2.3:20140820-160317.log (net-misc:radvd-2.3:20140820-160317.log,20.72 KB, text/plain)
2014-08-20 16:04 UTC, eroen
Details
test-suite.log (file_520332.txt,1.59 KB, text/plain)
2014-08-20 16:06 UTC, eroen
Details

Note You need to log in before you can comment on or make changes to this bug.
Description eroen 2014-08-20 16:04:42 UTC
Created attachment 383208 [details]
net-misc:radvd-2.3:20140820-160317.log

make  check-TESTS
make[1]: Entering directory '/tmp/portage/net-misc/radvd-2.3/work/radvd-2.3'
make[2]: Entering directory '/tmp/portage/net-misc/radvd-2.3/work/radvd-2.3'
FAIL: check_all
make[3]: Entering directory '/tmp/portage/net-misc/radvd-2.3/work/radvd-2.3'
make  all-am
make[4]: Entering directory '/tmp/portage/net-misc/radvd-2.3/work/radvd-2.3'
make[4]: Leaving directory '/tmp/portage/net-misc/radvd-2.3/work/radvd-2.3'
make[3]: Leaving directory '/tmp/portage/net-misc/radvd-2.3/work/radvd-2.3'
============================================================================
Testsuite summary for radvd 2.3
============================================================================
# TOTAL: 1
# PASS:  0
# SKIP:  0
# XFAIL: 0
# FAIL:  1
# XPASS: 0
# ERROR: 0
============================================================================
See ./test-suite.log
============================================================================
Makefile:1279: recipe for target 'test-suite.log' failed
make[2]: *** [test-suite.log] Error 1
make[2]: Leaving directory '/tmp/portage/net-misc/radvd-2.3/work/radvd-2.3'
Makefile:1385: recipe for target 'check-TESTS' failed
make[1]: *** [check-TESTS] Error 2
make[1]: Leaving directory '/tmp/portage/net-misc/radvd-2.3/work/radvd-2.3'
Makefile:1594: recipe for target 'check-am' failed
make: *** [check-am] Error 2
 * ERROR: net-misc/radvd-2.3::gentoo failed (test phase):
 *   Make check failed. See above for details.
 * 
 * Call stack:
 *          ebuild.sh, line   93:  Called src_test
 *        environment, line 2320:  Called __eapi0_src_test
 *   phase-helpers.sh, line  672:  Called die
 * The specific snippet of code:
 *   		$emake_cmd ${internal_opts} check || \
 *   			die "Make check failed. See above for details."
Comment 1 eroen 2014-08-20 16:06:27 UTC
Created attachment 383210 [details]
test-suite.log

...
test/send.c:115:P:build:test_add_route:0: Passed
test/send.c:143:P:build:test_add_rdnss:0: Passed
test/send.c:170:F:build:test_add_rdnss2:0: Assertion 'sizeof(expected)==sb.used' failed: sizeof(expected)==24, sb.used==56
test/send.c:218:P:build:test_add_dnssl:0: Passed
test/send.c:241:P:build:test_add_mtu:0: Passed
...
Comment 2 Matthew Thode ( prometheanfire ) archtester Gentoo Infrastructure gentoo-dev Security 2014-08-22 04:37:21 UTC
please test 2.5
Comment 3 eroen 2014-08-22 17:20:32 UTC
Thank you, radvd-2.5 test suite passes for me.