Gentoo Websites Logo
Go to: Gentoo Home Documentation Forums Lists Bugs Planet Store Wiki Get Gentoo!
Bug 519786 - dev-lang/ghc-7.8.3 - no libraries/transformers/dist-install/build/Control/Monad/Trans/Identity.dyn_o
Summary: dev-lang/ghc-7.8.3 - no libraries/transformers/dist-install/build/Control/Mon...
Status: UNCONFIRMED
Alias: None
Product: Gentoo Linux
Classification: Unclassified
Component: Current packages (show other bugs)
Hardware: All Linux
: Normal normal (vote)
Assignee: Gentoo's Haskell Language team
URL:
Whiteboard:
Keywords:
Depends on:
Blocks:
 
Reported: 2014-08-13 07:34 UTC by Juergen Rose
Modified: 2016-05-14 17:35 UTC (History)
0 users

See Also:
Package list:
Runtime testing required: ---


Attachments
bzip2ed build.log (build.log.bz2,102.42 KB, application/x-bzip2)
2014-08-13 07:34 UTC, Juergen Rose
Details

Note You need to log in before you can comment on or make changes to this bug.
Description Juergen Rose 2014-08-13 07:34:26 UTC
Created attachment 382804 [details]
bzip2ed build.log

'MAKEOPTS=-j1  emerge -vuDN ghc' fails with:
...
"inplace/bin/ghc-stage1" -hisuf hi -osuf  o -hcsuf hc -static  -H32m -O -optc-march=native -opta-march=native -optl-Wl,-O1 -optl-Wl,--as-needed -optc-fno-stack-protector    -package-name transformers-0.3.0.0 -hide-all-packages -i -ilibraries/transformers/. -ilibraries/transformers/dist-install/build -ilibraries/transformers/dist-install/build/autogen -Ilibraries/transformers/dist-install/build -Ilibraries/transformers/dist-install/build/autogen -Ilibraries/transformers/.    -optP-include -optPlibraries/transformers/dist-install/build/autogen/cabal_macros.h -package base-4.7.0.1 -XHaskell98 -O2  -no-user-package-db -rtsopts      -odir libraries/transformers/dist-install/build -hidir libraries/transformers/dist-install/build -stubdir libraries/transformers/dist-install/build -split-objs -dynamic-too -c libraries/transformers/./Control/Monad/Trans/Identity.hs -o libraries/transformers/dist-install/build/Control/Monad/Trans/Identity.o -dyno libraries/transformers/dist-install/build/Control/Monad/Trans/Identity.dyn_o

libraries/transformers/Control/Monad/Trans/Identity.hs:43:1:
    parse error on input ‘module’
libraries/transformers/ghc.mk:4: recipe for target 'libraries/transformers/dist-install/build/Control/Monad/Trans/Identity.o' failed
make[1]: *** [libraries/transformers/dist-install/build/Control/Monad/Trans/Identity.o] Error 1
Makefile:64: recipe for target 'ghc/stage2/build/tmp/ghc-stage2' failed
make: *** [ghc/stage2/build/tmp/ghc-stage2] Error 2
 * ERROR: dev-lang/ghc-7.8.3::gentoo failed (compile phase):





root@lynx2:/root(34)# emerge --info '=dev-lang/ghc-7.8.3::gentoo'
Portage 2.2.12 (python 2.7.8-final-0, default/linux/amd64/13.0/desktop, gcc-4.8.3, glibc-2.19-r1, 3.16.0-gentoo x86_64)
=================================================================
                         System Settings
=================================================================
System uname: Linux-3.16.0-gentoo-x86_64-Intel-R-_Core-TM-2_Duo_CPU_T7500_@_2.20GHz-with-gentoo-2.2
KiB Mem:     3971952 total,    777088 free
KiB Swap:   12582908 total,  12076748 free
Timestamp of tree: Wed, 13 Aug 2014 02:30:01 +0000
ld GNU ld (GNU Binutils) 2.24
app-shells/bash:          4.2_p47
dev-java/java-config:     2.2.0
dev-lang/python:          2.7.8, 3.3.5-r1, 3.4.1
dev-util/cmake:           2.8.12.2-r1
dev-util/pkgconfig:       0.28-r2
sys-apps/baselayout:      2.2
sys-apps/openrc:          0.12.4
sys-apps/sandbox:         2.6-r1
sys-devel/autoconf:       2.13, 2.69
sys-devel/automake:       1.9.6-r3, 1.10.3, 1.11.6, 1.12.6, 1.14.1
sys-devel/binutils:       2.24-r3
sys-devel/gcc:            4.8.3
sys-devel/gcc-config:     1.8
sys-devel/libtool:        2.4.2-r1
sys-devel/make:           4.0-r1
sys-kernel/linux-headers: 3.16 (virtual/os-headers)
sys-libs/glibc:           2.19-r1
Repositories: gentoo sunrise science x11 sage-on-gentoo x-portage g-cpan g-octave
ACCEPT_KEYWORDS="amd64 ~amd64"
ACCEPT_LICENSE="* -@EULA PUEL Intel-SDP dlj-1.1 skype-eula skype-4.0.0.7-copyright googleearth AdobeFlash-11.x cadsoft Oracle-BCLA-JavaSE MakeMKV-EULA NVIDIA-CUDA Nero-AAC-EULA GIMPS"
CBUILD="x86_64-pc-linux-gnu"
CFLAGS="-march=native -O2 -pipe"
CHOST="x86_64-pc-linux-gnu"
CONFIG_PROTECT="/etc /usr/kde/3.5/env /usr/kde/3.5/share/config /usr/kde/3.5/shutdown /usr/share/config /usr/share/gnupg/qualified.txt /var/lib/hsqldb"
CONFIG_PROTECT_MASK="/etc/ca-certificates.conf /etc/dconf /etc/env.d /etc/fonts/fonts.conf /etc/gconf /etc/gentoo-release /etc/php/apache2-php5.5/ext-active/ /etc/php/apache2-php5/ext-active/ /etc/php/cgi-php5.5/ext-active/ /etc/php/cgi-php5/ext-active/ /etc/php/cli-php5.5/ext-active/ /etc/php/cli-php5/ext-active/ /etc/revdep-rebuild /etc/sandbox.d /etc/terminfo /etc/texmf/language.dat.d /etc/texmf/language.def.d /etc/texmf/updmap.d /etc/texmf/web2c /etc/udev/rules.d"
CXXFLAGS="-march=native -O2 -pipe"
DISTDIR="/usr/portage/distfiles"
FCFLAGS="-O2 -pipe"
FEATURES="assume-digests binpkg-logs config-protect-if-modified distlocks ebuild-locks fixlafiles merge-sync news parallel-fetch preserve-libs protect-owned sandbox sfperms strict unknown-features-warn unmerge-logs unmerge-orphans userfetch userpriv usersandbox usersync xattr"
FFLAGS="-march=native -O2 -pipe"
GENTOO_MIRRORS="http://distfiles.gentoo.org"
LANG="en_US.UTF-8"
LDFLAGS="-Wl,-O1 -Wl,--as-needed"
MAKEOPTS="-j3"
PKGDIR="/usr/portage/packages"
PORTAGE_CONFIGROOT="/"
PORTAGE_RSYNC_OPTS="--recursive --links --safe-links --perms --times --omit-dir-times --compress --force --whole-file --delete --stats --human-readable --timeout=180 --exclude=/distfiles --exclude=/local --exclude=/packages"
PORTAGE_TMPDIR="/var/tmp"
PORTDIR="/usr/portage_lynx2"
PORTDIR_OVERLAY="/var/lib/layman/sunrise /var/lib/layman/science /var/lib/layman/x11 /var/lib/layman/sage-on-gentoo /usr/local/portage /var/lib/cpan /var/lib/g-octave"
USE="64bit R X Xaw3d a52 aac acl acpi admin afs alsa amd64 ao apache2 apng applet archive armadillo arpack asf aspell atlas audacious audiofile automap automount bash-completion berkdb blas blast bluetooth bluray boost branding bzip2 cairo cdda cddb cdf cdio cdparanoia cdr cgi chm cli cmake consolekit cracklib crypt css cups curl cxx daap db dbi dbm dbus declarative designer devhelp device-mapper dga dia dirac djvu doc dot dri ds2490 ds9097 ds9097u dts dv dvb dvd dvdr dvi dynamicplugin eds egl elf emacs emboss emf encode epiphany evo examples exif expat extensions extra extras faac faad fam ffmpeg fftw firefox fits flac fltk fontconfig foomaticdb fortran fortran95 fpm fpx fuse g3dvl garmin gcj gd gdal gdbm gdu gedit geoip geolocation geos gfortran gif gimp git glade glib glpk gml gmp gnome gnome-keyring gnome-print gnuplot gnutls gold gphoto2 gpm grammar graphics graphtft graphviz grass gsl gsm gstreamer gtk gtk3 gudev guile hddtemp hdf hdf5 hdri html http httpd hvm hwdb iconv icq icu id3tag ide imagemagick imap inotify introspection ipod ipv6 irda ithreads jabber jadetex java jbig jit john jpeg jpeg2k kate kde kdepim kdrive kerberos keymap kpathsea kvm ladspa lame lapack laptop latex lcms ldap lensfun libffi libkms libnotify libsamplerate lirc live lua lzma lzo mad mail maildir mapnik math matroska media-library mercurial mikmod mkl mmx mmxext mng mod modules mono motif mozilla mp3 mp4 mpeg mpi mplayer mtp multilib multimedia musepack musicbrainz mysql mysqli nautilus ncurses netcdf netpbm network networking nfs nls nntp nptl nsplugin ntfs ntp numpy obex objc ocaml ocr octave odbc ofa ogdi ogg openexr opengl openmp openvg pam pango pcre pda pdf pdl2 perl plasma plotutils plugins png podcast policykit portaudio posix postgres postscript ppds preview-latex proj projectm pstricks pulseaudio python python-bindings q32 qemu qhull qt3support qt4 quicktime raw readline reiserfs reports rle romio rpc rrdcgi rrdtool sage samba sasl schroedinger science sdk sdl secure-delete semantic-desktop server session shout sip slang slp smart smbclient smp sms sndfile snmp soap sockets sound soup sox speex spell sql sqlite sse sse2 ssl ssse3 startup-notification stlport subtitles subversion sudo suexec svg svm swig systemd szip t1lib tcl tcpd tex tex4ht texmacs theora thesaurus thinkpad threads thunderbird tidy tiff tk tools truetype udev udisks unicode upower usb utempter v4l vaapi vala valgrind vdpau video virt-network virtualbox visio vorbis vpx vtk wav webdav webdav-serf webkit wifi wmf wxwidgets x264 xa xattr xcb xetex xext xft xine xml xmlreader xmlrpc xpm xv xvid xvmc yaml youtube zlib zvbi" ABI_X86="64" ALSA_CARDS="intel8x0" APACHE2_MODULES="actions alias auth_basic auth_digest authn_anon authn_dbd authn_core authn_dbm authn_default authn_file authz_core authz_dbm authz_default authz_groupfile authz_host authz_owner authz_user autoindex cache cgid dav dav_fs dav_lock dbd deflate dir disk_cache env expires ext_filter file_cache filter headers ident imagemap include info lbmethod_byrequests log_config logio mem_cache mime mime_magic negotiation proxy proxy_ajp proxy_balancer proxy_connect proxy_http rewrite setenvif slotmem_shm so socache_shmcb speling status unique_id unixd userdir usertrack vhost_alias" CALLIGRA_FEATURES="kexi words flow plan sheets stage tables krita karbon braindump author" CAMERAS="canon fuji ptp2" COLLECTD_PLUGINS="df interface irq load memory rrdtool swap syslog" CURL_SSL="nss" DVB_CARDS="usb-wt220u" ELIBC="glibc" GPSD_PROTOCOLS="ashtech aivdm earthmate evermore fv18 garmin garmintxt gpsclock itrax mtk3301 nmea ntrip navcom oceanserver oldstyle oncore rtcm104v2 rtcm104v3 sirf superstar2 timing tsip tripmate tnt ublox ubx" INPUT_DEVICES="keyboard mouse evdev synaptics void" KERNEL="linux" LCD_DEVICES="cfontz hd44780 mtxorb ncurses X lcd2usb lcdlinux png usblcd" LIBREOFFICE_EXTENSIONS="presenter-console presenter-minimizer" LINGUAS="de fr ru" NETBEANS_MODULES="apisupport cnd dlight enterprise ergonomics groovy gsf harness ide identity j2ee java mobility nb php profiler websvccommon xml" OFFICE_IMPLEMENTATION="libreoffice" PHP_TARGETS="php5-3" PYTHON_SINGLE_TARGET="python2_7" PYTHON_TARGETS="python2_7 python3_3" QEMU_SOFTMMU_TARGETS="arm i386 x86_64" QEMU_USER_TARGETS="arm i386 x86_64" RUBY_TARGETS="ruby19 ruby20" USERLAND="GNU" VIDEO_CARDS="intel displaylink" XTABLES_ADDONS="quota2 psd pknock lscan length2 ipv4options ipset ipp2p iface geoip fuzzy condition tee tarpit sysrq steal rawnat logmark ipmark dhcpmac delude chaos account"
Unset:  CPPFLAGS, CTARGET, EMERGE_DEFAULT_OPTS, INSTALL_MASK, LC_ALL, PORTAGE_BUNZIP2_COMMAND, PORTAGE_COMPRESS, PORTAGE_COMPRESS_FLAGS, PORTAGE_RSYNC_EXTRA_OPTS, SYNC, USE_PYTHON




root@lynx2:/root(35)# emerge -pqv '=dev-lang/ghc-7.8.3::gentoo'
[ebuild     U ] dev-lang/ghc-7.8.3 [7.6.3-r1] USE="doc gmp -binary -ghcbootstrap -ghcmakebinary (-llvm%)"
Comment 1 Sergei Trofimovich gentoo-dev 2014-08-13 09:57:38 UTC
May I ask you to try without -march=native in CFLAGS?
Comment 2 Juergen Rose 2014-08-13 10:17:52 UTC
(In reply to Sergei Trofimovich from comment #1)
> May I ask you to try without -march=native in CFLAGS?

I will try, but I waiting for your answer to my second bug report concerning ghc-7.8.3. I also tried at this system 'emerge -v1 cabal;  MAKEOPTS=-j1  emerge -vuDN ghc'. This fails now with:

...
"inplace/bin/ghc-stage1" -hisuf p_hi -osuf  p_o -hcsuf p_hc -static -prof  -H32m -O -optc-march=native -opta-march=native -optl-Wl,-O1 -optl-Wl,--as-needed -optc-fno-stack-protector    -package-name ghc-7.8.3 -hide-all-packages -i -icompiler/basicTypes -icompiler/cmm -icompiler/codeGen -icompiler/coreSyn -icompiler/deSugar -icompiler/ghci -icompiler/hsSyn -icompiler/iface -icompiler/llvmGen -icompiler/main -icompiler/nativeGen -icompiler/parser -icompiler/prelude -icompiler/profiling -icompiler/rename -icompiler/simplCore -icompiler/simplStg -icompiler/specialise -icompiler/stgSyn -icompiler/stranal -icompiler/typecheck -icompiler/types -icompiler/utils -icompiler/vectorise -icompiler/stage2/build -icompiler/stage2/build/autogen -Icompiler/stage2/build -Icompiler/stage2/build/autogen -Icompiler/. -Icompiler/parser -Icompiler/utils -Icompiler/../rts/dist/build -Icompiler/stage2 -I/usr/lib64/libffi-3.1/include  -optP-DGHCI -optP-include -optPcompiler/stage2/build/autogen/cabal_macros.h -package Cabal-1.18.1.3 -package array-0.5.0.0 -package base-4.7.0.1 -package bin-package-db-0.0.0.0 -package bytestring-0.10.4.0 -package containers-0.5.5.1 -package directory-1.2.1.0 -package filepath-1.3.0.2 -package hoopl-3.10.0.1 -package hpc-0.6.0.1 -package process-1.2.0.0 -package template-haskell-2.9.0.0 -package time-1.4.2 -package transformers-0.3.0.0 -package unix-2.7.0.1 -Wall -fno-warn-name-shadowing -XHaskell98 -XCPP -XMagicHash -XUnboxedTuples -XPatternGuards -XForeignFunctionInterface -XEmptyDataDecls -XTypeSynonymInstances -XMultiParamTypeClasses -XFlexibleInstances -XRankNTypes -XScopedTypeVariables -XDeriveDataTypeable -XBangPatterns -XNondecreasingIndentation -optc-DTHREADED_RTS -DGHCI_TABLES_NEXT_TO_CODE -DSTAGE=2 -O2  -no-user-package-db -rtsopts      -odir compiler/stage2/build -hidir compiler/stage2/build -stubdir compiler/stage2/build   -c compiler/nativeGen/RegAlloc/Linear/FreeRegs.hs -o compiler/stage2/build/RegAlloc/Linear/FreeRegs.p_o -dyno compiler/stage2/build/RegAlloc/Linear/FreeRegs.dyn_o

compiler/nativeGen/RegAlloc/Linear/FreeRegs.hs:41:1:
    parse error (possibly incorrect indentation or mismatched brackets)
compiler/ghc.mk:640: recipe for target 'compiler/stage2/build/RegAlloc/Linear/FreeRegs.p_o' failed
make[1]: *** [compiler/stage2/build/RegAlloc/Linear/FreeRegs.p_o] Error 1
Makefile:64: recipe for target 'all' failed
make: *** [all] Error 2
Comment 3 Juergen Rose 2014-08-13 17:51:32 UTC
(In reply to Sergei Trofimovich from comment #1)
> May I ask you to try without -march=native in CFLAGS?

I just set CFLAGS to "-O2 -pipe" and it fails again with a similar error:

root@lynx2:/root(6)# MAKEOPTS=-j1  emerge -v1 ghc
...
libraries/array/Data/Array/Storable/Internals.hs:56:1:
    parse error on input ‘module’
libraries/array/ghc.mk:4: recipe for target 'libraries/array/dist-install/build/Data/Array/Storable/Internals.o' failed
make[1]: *** [libraries/array/dist-install/build/Data/Array/Storable/Internals.o] Error 1
Makefile:64: recipe for target 'ghc/stage2/build/tmp/ghc-stage2' failed
make: *** [ghc/stage2/build/tmp/ghc-stage2] Error 2
 * ERROR: dev-lang/ghc-7.8.3::gentoo failed (compile phase):
...
root@lynx2:/root(7)# grep ^CFLAGS /etc/portage/make.conf
CFLAGS="-O2 -pipe"

root@lynx2:/root(10)# grep " -O2 -pipe " /var/tmp/portage/dev-lang/ghc-7.8.3/temp/build.log | head
x86_64-pc-linux-gnu-gcc -E  -DMAKING_GHC_BUILD_SYSTEM_DEPENDENCIES  -fno-stack-protector -O2 -pipe -fno-stack-protector  -Icompiler/. -Icompiler/parser -Icompiler/utils -Icompiler/stage1     -isystem'/var/tmp/portage/dev-lang/ghc-7.8.3/work/usr/lib64/ghc-7.8.3/process-1.2.0.0/include' -isystem'/var/tmp/portage/dev-lang/ghc-7.8.3/work/usr/lib64/ghc-7.8.3/directory-1.2.1.0/include' -isystem'/var/tmp/portage/dev-lang/ghc-7.8.3/work/usr/lib64/ghc-7.8.3/unix-2.7.0.1/include' -isystem'/var/tmp/portage/dev-lang/ghc-7.8.3/work/usr/lib64/ghc-7.8.3/time-1.4.2/include' -isystem'/var/tmp/portage/dev-lang/ghc-7.8.3/work/usr/lib64/ghc-7.8.3/bytestring-0.10.4.0/include' -isystem'/var/tmp/portage/dev-lang/ghc-7.8.3/work/usr/lib64/ghc-7.8.3/base-4.7.0.1/include' -isystem'/var/tmp/portage/dev-lang/ghc-7.8.3/work/usr/lib64/ghc-7.8.3/integer-gmp-0.5.1.0/include' -isystem'/var/tmp/portage/dev-lang/ghc-7.8.3/work/usr/lib64/ghc-7.8.3/include'        -MM -x c compiler/ghci/keepCAFsForGHCi.c -MF compiler/stage1/build/.depend-v.c_asm.bit
x86_64-pc-linux-gnu-gcc -E  -DMAKING_GHC_BUILD_SYSTEM_DEPENDENCIES  -fno-stack-protector -O2 -pipe -fno-stack-protector  -Icompiler/. -Icompiler/parser -Icompiler/utils -Icompiler/stage1     -isystem'/var/tmp/portage/dev-lang/ghc-7.8.3/work/usr/lib64/ghc-7.8.3/process-1.2.0.0/include' -isystem'/var/tmp/portage/dev-lang/ghc-7.8.3/work/usr/lib64/ghc-7.8.3/directory-1.2.1.0/include' -isystem'/var/tmp/portage/dev-lang/ghc-7.8.3/work/usr/lib64/ghc-7.8.3/unix-2.7.0.1/include' -isystem'/var/tmp/portage/dev-lang/ghc-7.8.3/work/usr/lib64/ghc-7.8.3/time-1.4.2/include' -isystem'/var/tmp/portage/dev-lang/ghc-7.8.3/work/usr/lib64/ghc-7.8.3/bytestring-0.10.4.0/include' -isystem'/var/tmp/portage/dev-lang/ghc-7.8.3/work/usr/lib64/ghc-7.8.3/base-4.7.0.1/include' -isystem'/var/tmp/portage/dev-lang/ghc-7.8.3/work/usr/lib64/ghc-7.8.3/integer-gmp-0.5.1.0/include' -isystem'/var/tmp/portage/dev-lang/ghc-7.8.3/work/usr/lib64/ghc-7.8.3/include'        -MM -x c compiler/cbits/genSym.c -MF compiler/stage1/build/.depend-v.c_asm.bit
x86_64-pc-linux-gnu-gcc -E    -fno-stack-protector -O2 -pipe -fno-stack-protector -Iincludes -Iincludes/dist -Iincludes/dist-derivedconstants/header -Iincludes/dist-ghcconstants/header             -MM -x c utils/hp2ps/AreaBelow.c -MF utils/hp2ps/dist/build/.depend.c_asm.bit
x86_64-pc-linux-gnu-gcc -E    -fno-stack-protector -O2 -pipe -fno-stack-protector -Iincludes -Iincludes/dist -Iincludes/dist-derivedconstants/header -Iincludes/dist-ghcconstants/header             -MM -x c utils/hp2ps/Curves.c -MF utils/hp2ps/dist/build/.depend.c_asm.bit
x86_64-pc-linux-gnu-gcc -E    -fno-stack-protector -O2 -pipe -fno-stack-protector -Iincludes -Iincludes/dist -Iincludes/dist-derivedconstants/header -Iincludes/dist-ghcconstants/header             -MM -x c utils/hp2ps/Error.c -MF utils/hp2ps/dist/build/.depend.c_asm.bit
x86_64-pc-linux-gnu-gcc -E    -fno-stack-protector -O2 -pipe -fno-stack-protector -Iincludes -Iincludes/dist -Iincludes/dist-derivedconstants/header -Iincludes/dist-ghcconstants/header             -MM -x c utils/hp2ps/Main.c -MF utils/hp2ps/dist/build/.depend.c_asm.bit
x86_64-pc-linux-gnu-gcc -E    -fno-stack-protector -O2 -pipe -fno-stack-protector -Iincludes -Iincludes/dist -Iincludes/dist-derivedconstants/header -Iincludes/dist-ghcconstants/header             -MM -x c utils/hp2ps/Reorder.c -MF utils/hp2ps/dist/build/.depend.c_asm.bit
x86_64-pc-linux-gnu-gcc -E    -fno-stack-protector -O2 -pipe -fno-stack-protector -Iincludes -Iincludes/dist -Iincludes/dist-derivedconstants/header -Iincludes/dist-ghcconstants/header             -MM -x c utils/hp2ps/TopTwenty.c -MF utils/hp2ps/dist/build/.depend.c_asm.bit
x86_64-pc-linux-gnu-gcc -E    -fno-stack-protector -O2 -pipe -fno-stack-protector -Iincludes -Iincludes/dist -Iincludes/dist-derivedconstants/header -Iincludes/dist-ghcconstants/header             -MM -x c utils/hp2ps/AuxFile.c -MF utils/hp2ps/dist/build/.depend.c_asm.bit
x86_64-pc-linux-gnu-gcc -E    -fno-stack-protector -O2 -pipe -fno-stack-protector -Iincludes -Iincludes/dist -Iincludes/dist-derivedconstants/header -Iincludes/dist-ghcconstants/header             -MM -x c utils/hp2ps/Deviation.c -MF utils/hp2ps/dist/build/.depend.c_asm.bit


root@lynx2:/root(11)# grep " -O2 -pipe " /var/tmp/portage/dev-lang/ghc-7.8.3/temp/build.log | tail
x86_64-pc-linux-gnu-gcc -E  -DPROFILING -DTHREADED_RTS -DDEBUG  -fno-stack-protector -O2 -pipe -fno-stack-protector -Wall -Wextra -Wstrict-prototypes  -Wmissing-prototypes  -Wmissing-declarations -Winline -Waggregate-return -Wpointer-arith -Wmissing-noreturn -Wnested-externs -Wredundant-decls  -Iincludes -Iincludes/dist -Iincludes/dist-derivedconstants/header -Iincludes/dist-ghcconstants/header -Irts -Irts/dist/build -DCOMPILING_RTS -fno-strict-aliasing -fno-common        -O2 -fomit-frame-pointer -DRtsWay=\"rts_v\" -Wno-strict-prototypes -I/usr/lib64/libffi-3.1/include   -DPARALLEL_GC -Irts/sm -MM -x c rts/dist/build/sm/Evac_thr.c -MF rts/dist/build/.depend-v-p-dyn-l-debug-thr-thr_debug-thr_l-thr_p-debug_dyn-thr_dyn-thr_debug_dyn-l_dyn-thr_l_dyn.c_asm.bit
x86_64-pc-linux-gnu-gcc -E  -DPROFILING -DTHREADED_RTS -DDEBUG  -fno-stack-protector -O2 -pipe -fno-stack-protector -Wall -Wextra -Wstrict-prototypes  -Wmissing-prototypes  -Wmissing-declarations -Winline -Waggregate-return -Wpointer-arith -Wmissing-noreturn -Wnested-externs -Wredundant-decls  -Iincludes -Iincludes/dist -Iincludes/dist-derivedconstants/header -Iincludes/dist-ghcconstants/header -Irts -Irts/dist/build -DCOMPILING_RTS -fno-strict-aliasing -fno-common        -O2 -fomit-frame-pointer -DRtsWay=\"rts_v\" -Wno-strict-prototypes -I/usr/lib64/libffi-3.1/include   -DPARALLEL_GC -Irts/sm -MM -x c rts/dist/build/sm/Scav_thr.c -MF rts/dist/build/.depend-v-p-dyn-l-debug-thr-thr_debug-thr_l-thr_p-debug_dyn-thr_dyn-thr_debug_dyn-l_dyn-thr_l_dyn.c_asm.bit
x86_64-pc-linux-gnu-gcc -E  -DPROFILING -DTHREADED_RTS -DDEBUG  -fno-stack-protector -O2 -pipe -fno-stack-protector -Wall -Wextra -Wstrict-prototypes  -Wmissing-prototypes  -Wmissing-declarations -Winline -Waggregate-return -Wpointer-arith -Wmissing-noreturn -Wnested-externs -Wredundant-decls  -Iincludes -Iincludes/dist -Iincludes/dist-derivedconstants/header -Iincludes/dist-ghcconstants/header -Irts -Irts/dist/build -DCOMPILING_RTS -fno-strict-aliasing -fno-common        -O2 -fomit-frame-pointer -DRtsWay=\"rts_v\" -Wno-strict-prototypes -I/usr/lib64/libffi-3.1/include    -MM -x c rts/StgStartup.cmm -MF rts/dist/build/.depend-v-p-dyn-l-debug-thr-thr_debug-thr_l-thr_p-debug_dyn-thr_dyn-thr_debug_dyn-l_dyn-thr_l_dyn.c_asm.bit
x86_64-pc-linux-gnu-gcc -E  -DPROFILING -DTHREADED_RTS -DDEBUG  -fno-stack-protector -O2 -pipe -fno-stack-protector -Wall -Wextra -Wstrict-prototypes  -Wmissing-prototypes  -Wmissing-declarations -Winline -Waggregate-return -Wpointer-arith -Wmissing-noreturn -Wnested-externs -Wredundant-decls  -Iincludes -Iincludes/dist -Iincludes/dist-derivedconstants/header -Iincludes/dist-ghcconstants/header -Irts -Irts/dist/build -DCOMPILING_RTS -fno-strict-aliasing -fno-common        -O2 -fomit-frame-pointer -DRtsWay=\"rts_v\" -Wno-strict-prototypes -I/usr/lib64/libffi-3.1/include    -MM -x c rts/Exception.cmm -MF rts/dist/build/.depend-v-p-dyn-l-debug-thr-thr_debug-thr_l-thr_p-debug_dyn-thr_dyn-thr_debug_dyn-l_dyn-thr_l_dyn.c_asm.bit
x86_64-pc-linux-gnu-gcc -E  -DPROFILING -DTHREADED_RTS -DDEBUG  -fno-stack-protector -O2 -pipe -fno-stack-protector -Wall -Wextra -Wstrict-prototypes  -Wmissing-prototypes  -Wmissing-declarations -Winline -Waggregate-return -Wpointer-arith -Wmissing-noreturn -Wnested-externs -Wredundant-decls  -Iincludes -Iincludes/dist -Iincludes/dist-derivedconstants/header -Iincludes/dist-ghcconstants/header -Irts -Irts/dist/build -DCOMPILING_RTS -fno-strict-aliasing -fno-common        -O2 -fomit-frame-pointer -DRtsWay=\"rts_v\" -Wno-strict-prototypes -I/usr/lib64/libffi-3.1/include    -MM -x c rts/StgStdThunks.cmm -MF rts/dist/build/.depend-v-p-dyn-l-debug-thr-thr_debug-thr_l-thr_p-debug_dyn-thr_dyn-thr_debug_dyn-l_dyn-thr_l_dyn.c_asm.bit
x86_64-pc-linux-gnu-gcc -E  -DPROFILING -DTHREADED_RTS -DDEBUG  -fno-stack-protector -O2 -pipe -fno-stack-protector -Wall -Wextra -Wstrict-prototypes  -Wmissing-prototypes  -Wmissing-declarations -Winline -Waggregate-return -Wpointer-arith -Wmissing-noreturn -Wnested-externs -Wredundant-decls  -Iincludes -Iincludes/dist -Iincludes/dist-derivedconstants/header -Iincludes/dist-ghcconstants/header -Irts -Irts/dist/build -DCOMPILING_RTS -fno-strict-aliasing -fno-common        -O2 -fomit-frame-pointer -DRtsWay=\"rts_v\" -Wno-strict-prototypes -I/usr/lib64/libffi-3.1/include    -MM -x c rts/PrimOps.cmm -MF rts/dist/build/.depend-v-p-dyn-l-debug-thr-thr_debug-thr_l-thr_p-debug_dyn-thr_dyn-thr_debug_dyn-l_dyn-thr_l_dyn.c_asm.bit
x86_64-pc-linux-gnu-gcc -E  -DPROFILING -DTHREADED_RTS -DDEBUG  -fno-stack-protector -O2 -pipe -fno-stack-protector -Wall -Wextra -Wstrict-prototypes  -Wmissing-prototypes  -Wmissing-declarations -Winline -Waggregate-return -Wpointer-arith -Wmissing-noreturn -Wnested-externs -Wredundant-decls  -Iincludes -Iincludes/dist -Iincludes/dist-derivedconstants/header -Iincludes/dist-ghcconstants/header -Irts -Irts/dist/build -DCOMPILING_RTS -fno-strict-aliasing -fno-common        -O2 -fomit-frame-pointer -DRtsWay=\"rts_v\" -Wno-strict-prototypes -I/usr/lib64/libffi-3.1/include    -MM -x c rts/Apply.cmm -MF rts/dist/build/.depend-v-p-dyn-l-debug-thr-thr_debug-thr_l-thr_p-debug_dyn-thr_dyn-thr_debug_dyn-l_dyn-thr_l_dyn.c_asm.bit
x86_64-pc-linux-gnu-gcc -E  -DPROFILING -DTHREADED_RTS -DDEBUG  -fno-stack-protector -O2 -pipe -fno-stack-protector -Wall -Wextra -Wstrict-prototypes  -Wmissing-prototypes  -Wmissing-declarations -Winline -Waggregate-return -Wpointer-arith -Wmissing-noreturn -Wnested-externs -Wredundant-decls  -Iincludes -Iincludes/dist -Iincludes/dist-derivedconstants/header -Iincludes/dist-ghcconstants/header -Irts -Irts/dist/build -DCOMPILING_RTS -fno-strict-aliasing -fno-common        -O2 -fomit-frame-pointer -DRtsWay=\"rts_v\" -Wno-strict-prototypes -I/usr/lib64/libffi-3.1/include    -MM -x c rts/HeapStackCheck.cmm -MF rts/dist/build/.depend-v-p-dyn-l-debug-thr-thr_debug-thr_l-thr_p-debug_dyn-thr_dyn-thr_debug_dyn-l_dyn-thr_l_dyn.c_asm.bit
x86_64-pc-linux-gnu-gcc -E  -DPROFILING -DTHREADED_RTS -DDEBUG  -fno-stack-protector -O2 -pipe -fno-stack-protector -Wall -Wextra -Wstrict-prototypes  -Wmissing-prototypes  -Wmissing-declarations -Winline -Waggregate-return -Wpointer-arith -Wmissing-noreturn -Wnested-externs -Wredundant-decls  -Iincludes -Iincludes/dist -Iincludes/dist-derivedconstants/header -Iincludes/dist-ghcconstants/header -Irts -Irts/dist/build -DCOMPILING_RTS -fno-strict-aliasing -fno-common        -O2 -fomit-frame-pointer -DRtsWay=\"rts_v\" -Wno-strict-prototypes -I/usr/lib64/libffi-3.1/include    -MM -x c rts/Updates.cmm -MF rts/dist/build/.depend-v-p-dyn-l-debug-thr-thr_debug-thr_l-thr_p-debug_dyn-thr_dyn-thr_debug_dyn-l_dyn-thr_l_dyn.c_asm.bit
x86_64-pc-linux-gnu-gcc -E  -DPROFILING -DTHREADED_RTS -DDEBUG  -fno-stack-protector -O2 -pipe -fno-stack-protector -Wall -Wextra -Wstrict-prototypes  -Wmissing-prototypes  -Wmissing-declarations -Winline -Waggregate-return -Wpointer-arith -Wmissing-noreturn -Wnested-externs -Wredundant-decls  -Iincludes -Iincludes/dist -Iincludes/dist-derivedconstants/header -Iincludes/dist-ghcconstants/header -Irts -Irts/dist/build -DCOMPILING_RTS -fno-strict-aliasing -fno-common        -O2 -fomit-frame-pointer -DRtsWay=\"rts_v\" -Wno-strict-prototypes -I/usr/lib64/libffi-3.1/include    -MM -x c rts/StgMiscClosures.cmm -MF rts/dist/build/.depend-v-p-dyn-l-debug-thr-thr_debug-thr_l-thr_p-debug_dyn-thr_dyn-thr_debug_dyn-l_dyn-thr_l_dyn.c_asm.bit
Comment 4 Sergei Trofimovich gentoo-dev 2016-05-14 17:35:13 UTC
Do you still have this problem? I wonder if it's another instance of
bad hardware as in bug #519778