Gentoo Websites Logo
Go to: Gentoo Home Documentation Forums Lists Bugs Planet Store Wiki Get Gentoo!
Bug 483862 - dev-python/twisted-names-12.3.0 fails tests
Summary: dev-python/twisted-names-12.3.0 fails tests
Status: RESOLVED OBSOLETE
Alias: None
Product: Gentoo Linux
Classification: Unclassified
Component: Current packages (show other bugs)
Hardware: All Linux
: Normal normal (vote)
Assignee: Python Gentoo Team
URL:
Whiteboard:
Keywords:
Depends on:
Blocks:
 
Reported: 2013-09-06 05:46 UTC by Markus Meier
Modified: 2018-04-22 08:49 UTC (History)
1 user (show)

See Also:
Package list:
Runtime testing required: ---


Attachments
dev-python:twisted-names-12.3.0:20130825-143134.log (dev-python:twisted-names-12.3.0:20130825-143134.log,35.88 KB, text/plain)
2013-09-06 05:46 UTC, Markus Meier
Details

Note You need to log in before you can comment on or make changes to this bug.
Description Markus Meier gentoo-dev 2013-09-06 05:46:21 UTC
Created attachment 358006 [details]
dev-python:twisted-names-12.3.0:20130825-143134.log

This is a regression compared to dev-python/twisted-names-11.0.0.

 * Package:    dev-python/twisted-names-12.3.0
 * Repository: gentoo
 * Maintainer: python@gentoo.org
 * USE:        arm elibc_glibc kernel_linux test userland_GNU
 * FEATURES:   preserve-libs sandbox test userpriv usersandbox

===============================================================================
[ERROR]
Traceback (most recent call last):
  File "/var/tmp/portage/dev-python/twisted-names-12.3.0/temp/usr/lib/python2.7/site-packages/twisted/internet/defer.py", line 138, in maybeDeferred
    result = f(*args, **kw)
  File "/var/tmp/portage/dev-python/twisted-names-12.3.0/temp/usr/lib/python2.7/site-packages/twisted/internet/_utilspy3.py", line 41, in runWithWarningsSuppressed
    reraise(exc_info[1], exc_info[2])
  File "/var/tmp/portage/dev-python/twisted-names-12.3.0/temp/usr/lib/python2.7/site-packages/twisted/internet/_utilspy3.py", line 37, in runWithWarningsSuppressed
    result = f(*a, **kw)
  File "/var/tmp/portage/dev-python/twisted-names-12.3.0/temp/usr/lib/python2.7/site-packages/twisted/names/test/test_client.py", line 220, in test_overrideResolvConf
    resolver = client.createResolver(resolvconf=b"/foo/bar")
  File "/var/tmp/portage/dev-python/twisted-names-12.3.0/temp/usr/lib/python2.7/site-packages/twisted/names/client.py", line 534, in createResolver
    theResolver = Resolver(resolvconf, servers)
  File "/var/tmp/portage/dev-python/twisted-names-12.3.0/temp/usr/lib/python2.7/site-packages/twisted/names/client.py", line 118, in __init__
    self.maybeParseConfig()
  File "/var/tmp/portage/dev-python/twisted-names-12.3.0/temp/usr/lib/python2.7/site-packages/twisted/names/client.py", line 139, in maybeParseConfig
    resolvConf = FilePath(self.resolv).open()
  File "/var/tmp/portage/dev-python/twisted-names-12.3.0/temp/usr/lib/python2.7/site-packages/twisted/python/filepath.py", line 766, in open
    return open(self.path, mode + 'b')
exceptions.IOError: [Errno 20] Not a directory: '/foo/bar'

twisted.names.test.test_client.CreateResolverTests.test_overrideResolvConf
-------------------------------------------------------------------------------
Ran 271 tests in 23.552s

FAILED (errors=1, successes=270)
 * ERROR: dev-python/twisted-names-12.3.0 failed (test phase):
 *   Testing failed with CPython 2.7 in testing() function
 * 
 * Call stack:
 *     ebuild.sh, line   93:  Called src_test
 *   environment, line 5258:  Called twisted_src_test
 *   environment, line 5773:  Called python_execute_function 'testing'
 *   environment, line 3599:  Called die
 * The specific snippet of code:
 *                       die "${failure_message}";

Portage 2.1.12.2 (default/linux/arm/13.0/armv5te/desktop, gcc-4.6.3, glibc-2.15-r3, 3.8.13 armv5tel)
=================================================================
System uname: Linux-3.8.13-armv5tel-with-gentoo-2.2
KiB Mem:      513344 total,     77004 free
KiB Swap:     614396 total,    604740 free
Timestamp of tree: Fri, 23 Aug 2013 16:00:01 +0000
ld GNU ld (GNU Binutils) 2.23.1
ccache version 3.1.9 [disabled]
app-shells/bash:          4.2_p45
dev-lang/python:          2.6.8-r3, 2.7.5-r2, 3.2.5-r2
dev-util/ccache:          3.1.9
dev-util/cmake:           2.8.10.2-r2
sys-apps/baselayout:      2.2
sys-apps/openrc:          0.11.8
sys-apps/sandbox:         2.6-r1
sys-devel/autoconf:       2.13, 2.69
sys-devel/automake:       1.4_p6-r1, 1.5-r1, 1.6.3-r1, 1.7.9-r2, 1.8.5-r4, 1.9.6-r3, 1.10.3, 1.11.6, 1.12.6
sys-devel/binutils:       2.23.1
sys-devel/gcc:            4.5.4, 4.6.3
sys-devel/gcc-config:     1.7.3
sys-devel/libtool:        2.4-r1
sys-devel/make:           3.82-r4
sys-kernel/linux-headers: 3.7 (virtual/os-headers)
sys-libs/glibc:           2.15-r3
Repositories: gentoo
ACCEPT_KEYWORDS="arm"
ACCEPT_LICENSE="* -@EULA"
CBUILD="armv5tel-softfloat-linux-gnueabi"
CFLAGS="-O2 -march=armv5te -pipe"
CHOST="armv5tel-softfloat-linux-gnueabi"
CONFIG_PROTECT="/etc /usr/lib/python2.7/site-packages/buildbot/status/web /usr/share/gnupg/qualified.txt /var/bind /var/vpopmail/etc"
CONFIG_PROTECT_MASK="/etc/ca-certificates.conf /etc/dconf /etc/env.d /etc/fonts/fonts.conf /etc/gconf /etc/gentoo-release /etc/php/apache2-php5.3/ext-active/ /etc/php/apache2-php5.4/ext-active/ /etc/php/apache2-php5.5/ext-active/ /etc/php/cgi-php5.3/ext-active/ /etc/php/cgi-php5.4/ext-active/ /etc/php/cgi-php5.5/ext-active/ /etc/php/cli-php5.3/ext-active/ /etc/php/cli-php5.4/ext-active/ /etc/php/cli-php5.5/ext-active/ /etc/revdep-rebuild /etc/sandbox.d /etc/terminfo /etc/texmf/language.dat.d /etc/texmf/language.def.d /etc/texmf/updmap.d /etc/texmf/web2c"
CXXFLAGS="-O2 -march=armv5te -pipe"
DISTDIR="/usr/portage/distfiles"
EMERGE_DEFAULT_OPTS="--quiet-build=n --jobs=2 --keep-going --with-bdeps=y"
FCFLAGS="-O2 -pipe -march=armv5te"
FEATURES="assume-digests binpkg-logs collision-protect config-protect-if-modified distlocks ebuild-locks fixlafiles merge-sync news parallel-fetch preserve-libs protect-owned sandbox sfperms strict test unknown-features-warn unmerge-logs unmerge-orphans userfetch userpriv usersandbox"
FFLAGS="-O2 -pipe -march=armv5te"
GENTOO_MIRRORS="http://distfiles.gentoo.org"
LDFLAGS="-Wl,-O1 -Wl,--as-needed"
MAKEOPTS="-j2"
PKGDIR="/usr/portage/packages"
PORTAGE_CONFIGROOT="/"
PORTAGE_RSYNC_OPTS="--recursive --links --safe-links --perms --times --compress --force --whole-file --delete --stats --human-readable --timeout=180 --exclude=/distfiles --exclude=/local --exclude=/packages"
PORTAGE_TMPDIR="/var/tmp"
PORTDIR="/usr/portage"
PORTDIR_OVERLAY=""
SYNC="rsync://minil/gentoo-portage"
USE="X a52 aac acl acpi alsa apache2 arm berkdb bluetooth branding bzip2 cairo cdda cdr cli consolekit cracklib crypt cups cxx dbus dri dts dvdr emboss encode exif fam firefox flac fortran gdbm gif gpm gtk iconv jpeg kpathsea lcms ldap libnotify mad mng modules mp3 mp4 mpeg mudflap ncurses nls nptl ogg opengl openmp pam pango pcre pdf png policykit ppds qt3support qt4 readline sdl session spell ssl startup-notification svg tcpd test tiff truetype udev udisks unicode upower usb vorbis wxwidgets xcb xml xv xvid zlib" APACHE2_MODULES="authn_core authz_core socache_shmcb unixd actions alias auth_basic authn_alias authn_anon authn_dbm authn_default authn_file authz_dbm authz_default authz_groupfile authz_host authz_owner authz_user autoindex cache cgi cgid dav dav_fs dav_lock deflate dir disk_cache env expires ext_filter file_cache filter headers include info log_config logio mem_cache mime mime_magic negotiation rewrite setenvif speling status unique_id userdir usertrack vhost_alias" CALLIGRA_FEATURES="kexi words flow plan sheets stage tables krita karbon braindump author" CAMERAS="ptp2" COLLECTD_PLUGINS="df interface irq load memory rrdtool swap syslog" ELIBC="glibc" GPSD_PROTOCOLS="ashtech aivdm earthmate evermore fv18 garmin garmintxt gpsclock itrax mtk3301 nmea ntrip navcom oceanserver oldstyle oncore rtcm104v2 rtcm104v3 sirf superstar2 timing tsip tripmate tnt ubx" INPUT_DEVICES="keyboard mouse evdev" KERNEL="linux" LCD_DEVICES="bayrad cfontz cfontz633 glk hd44780 lb216 lcdm001 mtxorb ncurses text" LIBREOFFICE_EXTENSIONS="presenter-console presenter-minimizer" OFFICE_IMPLEMENTATION="libreoffice" PHP_TARGETS="php5-3" PYTHON_SINGLE_TARGET="python2_7" PYTHON_TARGETS="python2_6 python2_7 python3_2" RUBY_TARGETS="ruby18 ruby19" USERLAND="GNU" VIDEO_CARDS="exynos fbdev omap omapfb dummy v4l" XTABLES_ADDONS="quota2 psd pknock lscan length2 ipv4options ipset ipp2p iface geoip fuzzy condition tee tarpit sysrq steal rawnat logmark ipmark dhcpmac delude chaos account"
Unset:  CPPFLAGS, CTARGET, INSTALL_MASK, LANG, LC_ALL, PORTAGE_BUNZIP2_COMMAND, PORTAGE_COMPRESS, PORTAGE_COMPRESS_FLAGS, PORTAGE_RSYNC_EXTRA_OPTS, USE_PYTHON
Comment 1 Dirkjan Ochtman gentoo-dev 2013-09-06 06:54:17 UTC
I don't think this needs to block stabilization.
Comment 2 Markus Meier gentoo-dev 2013-09-06 15:46:32 UTC
(In reply to Dirkjan Ochtman from comment #1)
> I don't think this needs to block stabilization.

well if you say so - compared to current stable it's a regression...
Comment 3 Michał Górny archtester Gentoo Infrastructure gentoo-dev Security 2018-04-22 08:49:22 UTC
Obsolete in favor of dev-python/twisted.