Gentoo Websites Logo
Go to: Gentoo Home Documentation Forums Lists Bugs Planet Store Wiki Get Gentoo!
Bug 469394 - dev-util/systemtap-2.1 with sys-devel/automake-1.13 - configure.ac:22: error: 'AM_PROG_CC_STDC': this macro is obsolete.
Summary: dev-util/systemtap-2.1 with sys-devel/automake-1.13 - configure.ac:22: error:...
Status: UNCONFIRMED
Alias: None
Product: Gentoo Linux
Classification: Unclassified
Component: Current packages (show other bugs)
Hardware: All Linux
: Normal normal (vote)
Assignee: Sven Wegener
URL:
Whiteboard:
Keywords:
Depends on:
Blocks: automake-1.13
  Show dependency tree
 
Reported: 2013-05-11 10:03 UTC by Andreis Vinogradovs ( slepnoga )
Modified: 2017-12-16 11:25 UTC (History)
0 users

See Also:
Package list:
Runtime testing required: ---


Attachments

Note You need to log in before you can comment on or make changes to this bug.
Description Andreis Vinogradovs ( slepnoga ) 2013-05-11 10:03:51 UTC
configure.ac:22: error: 'AM_PROG_CC_STDC': this macro is obsolete.
    You should simply use the 'AC_PROG_CC' macro instead.
    Also, your code should no longer depend upon 'am_cv_prog_cc_stdc',
    but upon 'ac_cv_prog_cc_stdc'.
/usr/share/aclocal-1.13/obsolete-err.m4:17: AM_PROG_CC_STDC is expanded from...
configure.ac:22: the top level
autom4te-2.69: /usr/bin/m4 failed with exit status: 1
aclocal-1.13: error: echo failed with exit status: 1