Gentoo Websites Logo
Go to: Gentoo Home Documentation Forums Lists Bugs Planet Store Wiki Get Gentoo!
Bug 413233 - net-libs/libsoup-2.38.1 fails tests
Summary: net-libs/libsoup-2.38.1 fails tests
Status: VERIFIED TEST-REQUEST
Alias: None
Product: Gentoo Linux
Classification: Unclassified
Component: New packages (show other bugs)
Hardware: All Linux
: Normal normal (vote)
Assignee: Gentoo Linux Gnome Desktop Team
URL:
Whiteboard:
Keywords: TESTFAILURE
Depends on:
Blocks:
 
Reported: 2012-04-23 08:37 UTC by Patrick Lauer
Modified: 2013-11-29 21:17 UTC (History)
6 users (show)

See Also:
Package list:
Runtime testing required: ---


Attachments
build.log (libsoup-2.38.1_build.log,16.26 KB, text/plain)
2012-10-05 09:09 UTC, Nikoli
Details

Note You need to log in before you can comment on or make changes to this bug.
Description Patrick Lauer gentoo-dev 2012-04-23 08:37:22 UTC
>>> Test phase [check]: net-libs/libsoup-2.38.1
Making check in libsoup
make[1]: Entering directory `/var/tmp/portage/net-libs/libsoup-2.38.1/work/libsoup-2.38.1/libsoup'
make  check-am
make[2]: Entering directory `/var/tmp/portage/net-libs/libsoup-2.38.1/work/libsoup-2.38.1/libsoup'
make[2]: Leaving directory `/var/tmp/portage/net-libs/libsoup-2.38.1/work/libsoup-2.38.1/libsoup'
make[1]: Leaving directory `/var/tmp/portage/net-libs/libsoup-2.38.1/work/libsoup-2.38.1/libsoup'
Making check in tests
make[1]: Entering directory `/var/tmp/portage/net-libs/libsoup-2.38.1/work/libsoup-2.38.1/tests'
make  check-TESTS check-local
make[2]: Entering directory `/var/tmp/portage/net-libs/libsoup-2.38.1/work/libsoup-2.38.1/tests'
chunk-test: OK
PASS: chunk-test
coding-test: OK
PASS: coding-test
connection-test: OK
PASS: connection-test
context-test: OK
PASS: context-test
continue-test: OK
PASS: continue-test
cookies-test: OK
PASS: cookies-test
date: OK
PASS: date
header-parsing: OK
PASS: header-parsing
misc-test: OK
PASS: misc-test
ntlm-test: OK
PASS: ntlm-test
redirect-test: OK
PASS: redirect-test
requester-test: OK
PASS: requester-test
sniffing-test: OK
PASS: sniffing-test
ssl-test: OK
PASS: ssl-test
streaming-test: OK
PASS: streaming-test
timeout-test: OK
PASS: timeout-test
uri-parsing: OK
PASS: uri-parsing
forms-test: 23 error(s). Run with '-d' for details
FAIL: forms-test
server-auth-test: 140 error(s). Run with '-d' for details
FAIL: server-auth-test
========================================================================
2 of 19 tests failed
Please report to http://bugzilla.gnome.org/enter_bug.cgi?product=libsoup
========================================================================
make[2]: *** [check-TESTS] Error 1
make[2]: Leaving directory `/var/tmp/portage/net-libs/libsoup-2.38.1/work/libsoup-2.38.1/tests'
make[1]: *** [check-am] Error 2
make[1]: Leaving directory `/var/tmp/portage/net-libs/libsoup-2.38.1/work/libsoup-2.38.1/tests'
make: *** [check-recursive] Error 1
 * ERROR: net-libs/libsoup-2.38.1 failed (test phase):
 *   Make check failed. See above for details.

Portage 2.1.10.56 (default/linux/amd64/10.0, gcc-4.5.3, glibc-2.15-r1, 3.3.1-vs2.3.3.2 x86_64)
=================================================================
System uname: Linux-3.3.1-vs2.3.3.2-x86_64-AMD_Phenom-tm-_II_X4_965_Processor-with-gentoo-2.1
Timestamp of tree: Unknown
app-shells/bash:          4.2_p24
dev-lang/python:          2.7.3, 3.2.2-r1
dev-util/cmake:           2.8.7-r5
dev-util/pkgconfig:       0.26
sys-apps/baselayout:      2.1
sys-apps/openrc:          0.9.9.3
sys-apps/sandbox:         2.5
sys-devel/autoconf:       2.68
sys-devel/automake:       1.11.4
sys-devel/binutils:       2.22-r1
sys-devel/gcc:            4.5.3-r2
sys-devel/gcc-config:     1.6
sys-devel/libtool:        2.4.2
sys-devel/make:           3.82-r3
sys-kernel/linux-headers: 3.3 (virtual/os-headers)
sys-libs/glibc:           2.15-r1
Repositories: gentoo
ACCEPT_KEYWORDS="amd64 ~amd64"
ACCEPT_LICENSE="* -@EULA"
CBUILD="x86_64-pc-linux-gnu"
CFLAGS="-O2 -pipe"
CHOST="x86_64-pc-linux-gnu"
CONFIG_PROTECT="/etc /usr/share/config /usr/share/gnupg/qualified.txt /usr/share/themes/oxygen-gtk/gtk-2.0 /var/lib/hsqldb"
CONFIG_PROTECT_MASK="/etc/ca-certificates.conf /etc/env.d /etc/env.d/java/ /etc/fonts/fonts.conf /etc/gconf /etc/gentoo-release /etc/revdep-rebuild /etc/sandbox.d /etc/terminfo"
CXXFLAGS="-O2 -pipe"
DISTDIR="/usr/portage/distfiles"
FEATURES="assume-digests binpkg-logs buildpkg distlocks ebuild-locks fixlafiles news parallel-fetch protect-owned sandbox sfperms strict test unknown-features-warn unmerge-logs unmerge-orphans userfetch"
FFLAGS=""
GENTOO_MIRRORS="http://distfiles.gentoo.org"
LANG="en_GB.UTF-8"
LDFLAGS="-Wl,-O1 -Wl,--as-needed"
PKGDIR="/usr/portage/packages"
PORTAGE_CONFIGROOT="/"
PORTAGE_RSYNC_OPTS="--recursive --links --safe-links --perms --times --compress --force --whole-file --delete --stats --human-readable --timeout=180 --exclude=/distfiles --exclude=/local --exclude=/packages"
PORTAGE_TMPDIR="/var/tmp"
PORTDIR="/usr/portage"
PORTDIR_OVERLAY=""
SYNC="rsync://rsync.gentoo.org/gentoo-portage"
USE="acl amd64 berkdb bzip2 cli cracklib crypt cups cxx dri fortran gdbm gpm iconv ipv6 mmx modules mudflap multilib ncurses nls nptl nptlonly openmp pam pcre pppd readline session sse sse2 ssl sysfs tcpd unicode xa xorg zlib" ALSA_CARDS="ali5451 als4000 atiixp atiixp-modem bt87x ca0106 cmipci emu10k1x ens1370 ens1371 es1938 es1968 fm801 hda-intel intel8x0 intel8x0m maestro3 trident usb-audio via82xx via82xx-modem ymfpci" ALSA_PCM_PLUGINS="adpcm alaw asym copy dmix dshare dsnoop empty extplug file hooks iec958 ioplug ladspa lfloat linear meter mmap_emul mulaw multi null plug rate route share shm softvol" APACHE2_MODULES="actions alias auth_basic authn_alias authn_anon authn_dbm authn_default authn_file authz_dbm authz_default authz_groupfile authz_host authz_owner authz_user autoindex cache cgi cgid dav dav_fs dav_lock deflate dir disk_cache env expires ext_filter file_cache filter headers include info log_config logio mem_cache mime mime_magic negotiation rewrite setenvif speling status unique_id userdir usertrack vhost_alias" CALLIGRA_FEATURES="kexi words flow plan sheets stage tables krita karbon braindump" CAMERAS="ptp2" COLLECTD_PLUGINS="df interface irq load memory rrdtool swap syslog" ELIBC="glibc" GPSD_PROTOCOLS="ashtech aivdm earthmate evermore fv18 garmin garmintxt gpsclock itrax mtk3301 nmea ntrip navcom oceanserver oldstyle oncore rtcm104v2 rtcm104v3 sirf superstar2 timing tsip tripmate tnt ubx" INPUT_DEVICES="keyboard mouse evdev" KERNEL="linux" LCD_DEVICES="bayrad cfontz cfontz633 glk hd44780 lb216 lcdm001 mtxorb ncurses text" PHP_TARGETS="php5-3" RUBY_TARGETS="ruby18" USERLAND="GNU" VIDEO_CARDS="fbdev glint intel mach64 mga neomagic nouveau nv r128 radeon savage sis tdfx trident vesa via vmware dummy v4l" XTABLES_ADDONS="quota2 psd pknock lscan length2 ipv4options ipset ipp2p iface geoip fuzzy condition tee tarpit sysrq steal rawnat logmark ipmark dhcpmac delude chaos account"
Unset:  CPPFLAGS, CTARGET, EMERGE_DEFAULT_OPTS, INSTALL_MASK, LC_ALL, LINGUAS, MAKEOPTS, PORTAGE_BUNZIP2_COMMAND, PORTAGE_COMPRESS, PORTAGE_COMPRESS_FLAGS, PORTAGE_RSYNC_EXTRA_OPTS, USE_PYTHON
Comment 1 Pacho Ramos gentoo-dev 2012-07-07 12:54:01 UTC
Would be nice if you could send this also to upstream. Thanks
Comment 2 Nikoli 2012-10-05 09:09:31 UTC
Created attachment 325704 [details]
build.log

Same problem.

Portage 2.1.11.9 (hardened/linux/amd64, gcc-4.5.4, glibc-2.15-r2, 3.5.3-hardened-r1 x86_64)
=================================================================
                        System Settings
=================================================================
Timestamp of tree: Fri, 05 Oct 2012 08:00:01 +0000
app-shells/bash:          4.2_p37
dev-java/java-config:     2.1.11-r3
dev-lang/python:          2.7.3-r2
dev-util/cmake:           2.8.9-r1
dev-util/pkgconfig:       0.27.1
sys-apps/baselayout:      2.1-r1
sys-apps/openrc:          0.9.8.4
sys-apps/sandbox:         2.5
sys-devel/autoconf:       2.68
sys-devel/automake:       1.11.6
sys-devel/binutils:       2.22-r1
sys-devel/gcc:            4.5.4
sys-devel/gcc-config:     1.7.3
sys-devel/libtool:        2.4-r1
sys-devel/make:           3.82-r3
sys-kernel/linux-headers: 3.4-r2 (virtual/os-headers)
sys-libs/glibc:           2.15-r2
Repositories: gentoo nikoli
ACCEPT_KEYWORDS="amd64"
ACCEPT_LICENSE="* -@EULA"
CBUILD="x86_64-pc-linux-gnu"
CFLAGS="-march=core2 -mtune=generic -mavx -maes -mpclmul -O2 -pipe"
CHOST="x86_64-pc-linux-gnu"
CONFIG_PROTECT="/etc /usr/share/config /usr/share/gnupg/qualified.txt /usr/share/openvpn/easy-rsa /usr/share/themes/oxygen-gtk/gtk-2.0"
CONFIG_PROTECT_MASK="/etc/ca-certificates.conf /etc/env.d /etc/env.d/java/ /etc/fonts/fonts.conf /etc/gconf /etc/gentoo-release /etc/revdep-rebuild /etc/sandbox.d /etc/terminfo"
CXXFLAGS="-march=core2 -mtune=generic -mavx -maes -mpclmul -O2 -pipe"
DISTDIR="/var/package-manager/distfiles"
FCFLAGS="-O2 -pipe"
FEATURES="assume-digests binpkg-logs config-protect-if-modified distlocks ebuild-locks fixlafiles news parallel-fetch parse-eapi-ebuild-head protect-owned sandbox sfperms strict test unknown-features-warn unmerge-logs unmerge-orphans userfetch userpriv usersandbox usersync xattr"
FFLAGS="-O2 -pipe"
LANG="en_US.UTF-8"
LDFLAGS="-Wl,-O1 -Wl,--as-needed"
LINGUAS="ru en"
MAKEOPTS="-j9"
PKGDIR="/var/package-manager/packages/corei7-avx_hardened"
PORTAGE_CONFIGROOT="/"
PORTAGE_RSYNC_OPTS="--recursive --links --safe-links --perms --times --compress --force --whole-file --delete --stats --human-readable --timeout=180 --exclude=/distfiles --exclude=/local --exclude=/packages"
PORTDIR="/var/package-manager/portage"
PORTDIR_OVERLAY="/var/lib/layman/nikoli"
USE="X a52 aac acl acpi aes-ni akonadi alsa amd64 amr atm audiofile avx bash-completion bluetooth bzip2 cairo caps cdda cddb cdio cdparanoia cdr celt cli consolekit cracklib crypt css cups cxx dbus djvu dri dts dv dvd dvdr encode exif fat ffmpeg flac fluidsynth fontconfig fortran gd geoip gif gimp gmp gnutls gphoto2 gpm graphviz gsm gstreamer gtk handbook hardened iconv icu id3tag idn ilbc imagemagick imap imlib ios ipod ipv6 jbig jpeg jpeg2k justify kde kipi kontact lame laptop lcms libass libnotify libproxy libsamplerate lm_sensors lzma lzo mac mad matroska mikmod mmx mmxext mng modplug modules mp3 mp4 mpeg mtp mudflap multilib musepack musicbrainz ncurses networkmanager nls nptl nptlonly ntfs ogg openal openexr opengl openmp pam pango pax_kernel pcre pdf pg-intdatetime phonon plasma pm-utils png policykit postscript pppd qt3support qt4 quicktime rar raw readline reiserfs replaygain rtmp sasl scanner schroedinger semantic-desktop session sid smp sndfile socks5 speex spell sqlite sse sse2 sse3 sse4_1 ssl ssse3 startup-notification svg symlink sysfs taglib theora threads thumbnail tiff truetype tta udev unicode upnp usb v4l v4l2 vaapi vcd vdpau vorbis vpx wavpack webkit webp wifi wma wmf wps x264 xattr xcb xcomposite xface xinerama xml xmp xpm xscreensaver xv xvid xz zip zlib" ALSA_CARDS="ali5451 als4000 atiixp atiixp-modem bt87x ca0106 cmipci emu10k1x ens1370 ens1371 es1938 es1968 fm801 hda-intel intel8x0 intel8x0m maestro3 trident usb-audio via82xx via82xx-modem ymfpci" ALSA_PCM_PLUGINS="adpcm alaw asym copy dmix dshare dsnoop empty extplug file hooks iec958 ioplug ladspa lfloat linear meter mmap_emul mulaw multi null plug rate route share shm softvol" APACHE2_MODULES="actions alias auth_basic authn_alias authn_anon authn_dbm authn_default authn_file authz_dbm authz_default authz_groupfile authz_host authz_owner authz_user autoindex cache cgi cgid dav dav_fs dav_lock deflate dir disk_cache env expires ext_filter file_cache filter headers include info log_config logio mem_cache mime mime_magic negotiation rewrite setenvif speling status unique_id userdir usertrack vhost_alias" CALLIGRA_FEATURES="kexi words flow plan sheets stage tables krita karbon braindump" CAMERAS="*" COLLECTD_PLUGINS="df interface irq load memory rrdtool swap syslog" ELIBC="glibc" GPSD_PROTOCOLS="ashtech aivdm earthmate evermore fv18 garmin garmintxt gpsclock itrax mtk3301 nmea ntrip navcom oceanserver oldstyle oncore rtcm104v2 rtcm104v3 sirf superstar2 timing tsip tripmate tnt ubx" GRUB_PLATFORMS="efi-64" INPUT_DEVICES="evdev" KERNEL="linux" LCD_DEVICES="bayrad cfontz cfontz633 glk hd44780 lb216 lcdm001 mtxorb ncurses text" LIBREOFFICE_EXTENSIONS="nlpsolver pdfimport presenter-console presenter-minimizer report-builder" LINGUAS="ru en" NGINX_MODULES_HTTP="access auth_basic autoindex fastcgi gzip rewrite" PHP_TARGETS="php5-3" PYTHON_TARGETS="python3_2 python2_7" QEMU_SOFTMMU_TARGETS="i386 x86_64" QEMU_USER_TARGETS="i386 x86_64" RUBY_TARGETS="ruby18 ruby19" USERLAND="GNU" VIDEO_CARDS="radeon r600 modesetting vesa" XTABLES_ADDONS="quota2 psd pknock lscan length2 ipv4options ipset ipp2p iface geoip fuzzy condition tee tarpit sysrq steal rawnat logmark ipmark dhcpmac delude chaos account"

=================================================================
                        Package Settings
=================================================================

net-libs/libsoup-2.38.1 was built with the following:
USE="introspection (multilib) ssl -debug -doc -samba (-test)"
Comment 3 Pacho Ramos gentoo-dev 2013-08-26 12:27:36 UTC
Please try with 2.42
Comment 4 Gilles Dartiguelongue gentoo-dev 2013-08-31 16:46:49 UTC
FTR, all test failures in 2.42 were reported upstream by me so if it's still not passing tests, next bump should be fine.
Comment 5 Markus Oehme 2013-09-03 09:01:13 UTC
(In reply to Pacho Ramos from comment #3)
> Please try with 2.42

The initially failing tests (forms-test and server-auth-test) work for me, but cache-test fails in 2.42.2-r1.
Comment 6 Pacho Ramos gentoo-dev 2013-11-15 20:15:24 UTC
2.42.3.1 looks to pass all tests for me, if still hitting any test failure, please reopen and *also* open a bug on bugzilla.gnome.org to let upstream be aware of the issue (otherwise, the issue will likely persist)
Comment 7 Markus Oehme 2013-11-28 21:28:42 UTC
(In reply to Pacho Ramos from comment #6)
> 2.42.3.1 looks to pass all tests for me, if still hitting any test failure,
> please reopen and *also* open a bug on bugzilla.gnome.org to let upstream be
> aware of the issue (otherwise, the issue will likely persist)

I still see test failures on hardened ~amd64. I reported this upstream at [1]. I cannot edit the URL field, thus inline. Should I provide more information here or do we wait for upstream handling?

[1] https://bugzilla.gnome.org/show_bug.cgi?id=719517
Comment 8 Pacho Ramos gentoo-dev 2013-11-28 22:40:07 UTC
(In reply to Markus Oehme from comment #7)
> (In reply to Pacho Ramos from comment #6)
> > 2.42.3.1 looks to pass all tests for me, if still hitting any test failure,
> > please reopen and *also* open a bug on bugzilla.gnome.org to let upstream be
> > aware of the issue (otherwise, the issue will likely persist)
> 
> I still see test failures on hardened ~amd64. I reported this upstream at
> [1]. I cannot edit the URL field, thus inline. Should I provide more
> information here or do we wait for upstream handling?
> 
> [1] https://bugzilla.gnome.org/show_bug.cgi?id=719517

Looks like a different test failure than originally reported one

Also, you could try to append "virtualx" in inherit line in ebuild and add:
src_test() {
     Xemake check
}

As looks like it's failing because cannot open X
Comment 9 Markus Oehme 2013-11-28 23:10:00 UTC
(In reply to Pacho Ramos from comment #8)
> (In reply to Markus Oehme from comment #7)
> > (In reply to Pacho Ramos from comment #6)
> > > 2.42.3.1 looks to pass all tests for me, if still hitting any test failure,
> > > please reopen and *also* open a bug on bugzilla.gnome.org to let upstream be
> > > aware of the issue (otherwise, the issue will likely persist)
> > 
> > I still see test failures on hardened ~amd64. I reported this upstream at
> > [1]. I cannot edit the URL field, thus inline. Should I provide more
> > information here or do we wait for upstream handling?
> > 
> > [1] https://bugzilla.gnome.org/show_bug.cgi?id=719517
> 
> Looks like a different test failure than originally reported one

Sorry for the mismatch there.
 
> Also, you could try to append "virtualx" in inherit line in ebuild and add:
> src_test() {
>      Xemake check
> }
> 
> As looks like it's failing because cannot open X

Neither this proposal, nor running it in a terminal with X available did change the test failures.
Comment 10 Markus Oehme 2013-11-28 23:12:40 UTC
Taking a closer look at the log, it seems to fail to connect to dbus (which is running).
Comment 11 Pacho Ramos gentoo-dev 2013-11-29 06:46:33 UTC
Sometimes running tests with:
dbus-launch Xemake check

helps
Comment 12 Markus Oehme 2013-11-29 09:04:52 UTC
(In reply to Pacho Ramos from comment #11)
> Sometimes running tests with:
> dbus-launch Xemake check
> 
> helps

Modifying it to

src_test() {
    dbus-launch
    Xemake check
}

caused three tests to succeed. Only cache-test still fails, but outputs only "cache-test: 1 error(s). Run with '-d' for details".
Comment 13 Pacho Ramos gentoo-dev 2013-11-29 21:17:16 UTC
+  29 Nov 2013; Pacho Ramos <pacho@gentoo.org> -libsoup-2.42.2-r1.ebuild,
+  libsoup-2.42.3.1.ebuild:
+  Try to prevent more test failures, bug #413233#c7 by Markus Oehme, drop old.
+

(In reply to Markus Oehme from comment #12)
> caused three tests to succeed. Only cache-test still fails, but outputs only
> "cache-test: 1 error(s). Run with '-d' for details".

For this, please open a separate bug report with that output as I still can't reproduce it :(