Gentoo Websites Logo
Go to: Gentoo Home Documentation Forums Lists Bugs Planet Store Wiki Get Gentoo!
Bug 404089 - app-emulation/vmware-modules-264.1 with kernel 3.2.1-gentoo-r2 - work/vmmon-only/linux/hostif.c:2404:4: error: implicit declaration of function '__fix_to_virt'
Summary: app-emulation/vmware-modules-264.1 with kernel 3.2.1-gentoo-r2 - work/vmmon-o...
Status: RESOLVED DUPLICATE of bug 392379
Alias: None
Product: Gentoo Linux
Classification: Unclassified
Component: Current packages (show other bugs)
Hardware: AMD64 Linux
: Normal normal (vote)
Assignee: Vadim Kuznetsov (RETIRED)
Depends on:
Reported: 2012-02-16 10:57 UTC by Maksym Pugach
Modified: 2012-03-26 11:36 UTC (History)
3 users (show)

See Also:
Package list:
Runtime testing required: ---

complete build log (app-emulation:vmware-modules-264.1:20120216-084908.log,9.31 KB, text/plain)
2012-02-16 10:59 UTC, Maksym Pugach
ebuild environment (environment,126.93 KB, text/plain)
2012-02-16 11:00 UTC, Maksym Pugach
/var/tmp/portage/app-emulation/vmware-modules-264.1/work dir (vmware-modules-264.1_work.tar.bz2,877.25 KB, text/plain)
2012-02-16 11:01 UTC, Maksym Pugach

Note You need to log in before you can comment on or make changes to this bug.
Description Maksym Pugach 2012-02-16 10:57:02 UTC
Trying to emerge app-emulation/vmware-workstation All packages compile successfully except subject one.

/var/tmp/portage/app-emulation/vmware-modules-264.1/work/vmmon-only/linux/hostif.c: In function 'HostIF_APICInit':
/var/tmp/portage/app-emulation/vmware-modules-264.1/work/vmmon-only/linux/hostif.c:2404:4: error: implicit declaration of function '__fix_to_virt'
/var/tmp/portage/app-emulation/vmware-modules-264.1/work/vmmon-only/linux/hostif.c:2404:26: error: 'FIX_APIC_BASE' undeclared (first use in this function)
/var/tmp/portage/app-emulation/vmware-modules-264.1/work/vmmon-only/linux/hostif.c:2404:26: note: each undeclared identifier is reported only once for each f
unction it appears inmake[3]: *** [/var/tmp/portage/app-emulation/vmware-modules-264.1/work/vmmon-only/linux/hostif.o] Error 1make[3]: *** Waiting for unfinished jobs....make[2]: *** [_module_/var/tmp/portage/app-emulation/vmware-modules-264.1/work/vmmon-only] Error 2
make[1]: *** [sub-make] Error 2
make[1]: Leaving directory `/usr/src/linux-3.2.1-gentoo-r2'
make: *** [vmmon.ko] Error 2
emake failed

Reproducible: Always

Steps to Reproduce:
1. echo "=app-emulation/vmware-modules-264.1 ~amd64" >> /etc/portage/package.accept_keywords 
echo "=app-emulation/vmware-workstation- ~amd64" >> /etc/portage/package.accept_keywords 

2. emerge vmware-workstation

Actual Results:  
All packages emerge successfully, except vmware-modules-264.1

Portage (default/linux/amd64/10.0/desktop, gcc-4.5.3, glibc-2.13-r4, 3.2.1-gentoo-r2 x86_64)
                        System Settings
System uname: Linux-3.2.1-gentoo-r2-x86_64-AMD_Opteron-tm-_Processor_148-with-gentoo-2.0.3
Timestamp of tree: Thu, 16 Feb 2012 07:45:01 +0000
app-shells/bash:          4.1_p9
dev-lang/python:          2.7.2-r3, 3.1.4-r3
dev-util/cmake:           2.8.6-r4
dev-util/pkgconfig:       0.26
sys-apps/baselayout:      2.0.3
sys-apps/sandbox:         2.5
sys-devel/autoconf:       2.13, 2.68
sys-devel/automake:       1.9.6-r3, 1.11.1
sys-devel/binutils:       2.21.1-r1
sys-devel/gcc:            4.5.3-r1
sys-devel/gcc-config:     1.4.1-r1
sys-devel/libtool:        2.4-r1
sys-devel/make:           3.82-r1
sys-kernel/linux-headers: 3.1 (virtual/os-headers)
sys-libs/glibc:           2.13-r4
Repositories: gentoo
CFLAGS="-march=opteron -O2 -pipe"
CONFIG_PROTECT_MASK="/etc/ca-certificates.conf /etc/env.d /etc/fonts/fonts.conf /etc/gconf /etc/gentoo-release /etc/revdep-rebuild /etc/sandbox.d /etc/terminfo"
CXXFLAGS="-march=opteron -O2 -pipe"
FEATURES="assume-digests binpkg-logs distlocks ebuild-locks fixlafiles news parallel-fetch protect-owned sandbox sfperms strict unknown-features-warn unmerge-logs unmerge-orphans userfetch"
GENTOO_MIRRORS=" rsync://"
LDFLAGS="-Wl,-O1 -Wl,--as-needed"
LINGUAS="ru uk en"
PORTAGE_RSYNC_OPTS="--recursive --links --safe-links --perms --times --compress --force --whole-file --delete --stats --timeout=180 --exclude=/distfiles --exclude=/local --exclude=/packages"
USE="X a52 aac acl acpi alsa amd64 berkdb bluetooth branding bzip2 cairo cdda cdr cli consolekit cracklib crypt cups cxx dbus dri dts dvd dvdr emboss encode exif fam firefox flac fortran gdbm gdu gif gpm gtk iconv ipv6 jpeg lcms ldap libnotify lock mad mmx mng modules mp3 mp4 mpeg mudflap multilib ncurses nls nptl nptlonly ogg opengl openmp pam pango pcre pdf png policykit ppds pppd qt3support readline sdl session spell sse sse2 ssl startup-notification svg sysfs tcpd thunar tiff truetype udev unicode usb vorbis x264 xcb xml xorg xulrunner xv xvid zlib" ALSA_CARDS="ali5451 als4000 atiixp atiixp-modem bt87x ca0106 cmipci emu10k1x ens1370 ens1371 es1938 es1968 fm801 hda-intel intel8x0 intel8x0m maestro3 trident usb-audio via82xx via82xx-modem ymfpci" ALSA_PCM_PLUGINS="adpcm alaw asym copy dmix dshare dsnoop empty extplug file hooks iec958 ioplug ladspa lfloat linear meter mmap_emul mulaw multi null plug rate route share shm softvol" APACHE2_MODULES="actions alias auth_basic authn_alias authn_anon authn_dbm authn_default authn_file authz_dbm authz_default authz_groupfile authz_host authz_owner authz_user autoindex cache cgi cgid dav dav_fs dav_lock deflate dir disk_cache env expires ext_filter file_cache filter headers include info log_config logio mem_cache mime mime_magic negotiation rewrite setenvif speling status unique_id userdir usertrack vhost_alias" CALLIGRA_FEATURES="kexi words flow plan stage tables krita karbon braindump" CAMERAS="ptp2" COLLECTD_PLUGINS="df interface irq load memory rrdtool swap syslog" ELIBC="glibc" GPSD_PROTOCOLS="ashtech aivdm earthmate evermore fv18 garmin garmintxt gpsclock itrax mtk3301 nmea ntrip navcom oceanserver oldstyle oncore rtcm104v2 rtcm104v3 sirf superstar2 timing tsip tripmate tnt ubx" INPUT_DEVICES="evdev" KERNEL="linux" LCD_DEVICES="bayrad cfontz cfontz633 glk hd44780 lb216 lcdm001 mtxorb ncurses text" LINGUAS="ru uk en" PHP_TARGETS="php5-3" RUBY_TARGETS="ruby18" USERLAND="GNU" VIDEO_CARDS="nvidia" XTABLES_ADDONS="quota2 psd pknock lscan length2 ipv4options ipset ipp2p iface geoip fuzzy condition tee tarpit sysrq steal rawnat logmark ipmark dhcpmac delude chaos account"
Comment 1 Maksym Pugach 2012-02-16 10:59:39 UTC
Created attachment 302129 [details]
complete build log
Comment 2 Maksym Pugach 2012-02-16 11:00:58 UTC
Created attachment 302131 [details]
ebuild environment
Comment 3 Maksym Pugach 2012-02-16 11:01:47 UTC
Created attachment 302133 [details]
/var/tmp/portage/app-emulation/vmware-modules-264.1/work dir
Comment 4 Maksym Pugach 2012-02-16 11:03:08 UTC
emerge -pqv =app-emulation/vmware-modules-264.1

[ebuild  N    ] app-emulation/vmware-modules-264.1
Comment 5 Baptiste aka mRyOuNg 2012-03-09 05:52:29 UTC
It seems to be the same bug as 392379 ...
But i just tried to apply apic.patch on this version of vmware-modules without any success ...
Comment 6 Maksym Pugach 2012-03-26 11:36:37 UTC
Sorry. Do not have time for this, need to work. Moved to Debian.

*** This bug has been marked as a duplicate of bug 392379 ***