Gentoo Websites Logo
Go to: Gentoo Home Documentation Forums Lists Bugs Planet Store Wiki Get Gentoo!
Bug 355545 - media-libs/gst-plugins-base-0.10.36 fails test
Summary: media-libs/gst-plugins-base-0.10.36 fails test
Status: RESOLVED OBSOLETE
Alias: None
Product: Gentoo Linux
Classification: Unclassified
Component: Current packages (show other bugs)
Hardware: All Linux
: High normal (vote)
Assignee: GStreamer package maintainers
URL:
Whiteboard:
Keywords: TESTFAILURE
Depends on:
Blocks:
 
Reported: 2011-02-19 11:09 UTC by Kacper Kowalik (Xarthisius) (RETIRED)
Modified: 2019-06-22 08:48 UTC (History)
1 user (show)

See Also:
Package list:
Runtime testing required: ---


Attachments
build.log (gst-plugins-base-0.10.31:20110219-105352.log,87.97 KB, text/plain)
2011-02-19 11:09 UTC, Kacper Kowalik (Xarthisius) (RETIRED)
Details
test failures on PPC64 (gst-plugins-base-0.10.36:20130201-141122.log,753.63 KB, text/plain)
2013-02-01 17:24 UTC, Agostino Sarubbo
Details

Note You need to log in before you can comment on or make changes to this bug.
Description Kacper Kowalik (Xarthisius) (RETIRED) gentoo-dev 2011-02-19 11:09:00 UTC
Portage 2.1.9.25 (default/linux/powerpc/ppc64/10.0/64bit-userland/desktop/gnome, gcc-4.4.5, glibc-2.11.2-r3, 2.6.28-gentoo ppc64)
=================================================================
System uname: Linux-2.6.28-gentoo-ppc64-POWER5+_-gs-with-gentoo-1.12.14
Timestamp of tree: Thu, 17 Feb 2011 19:30:01 +0000
app-shells/bash:     4.1_p7
dev-lang/python:     2.6.6-r1, 3.1.2-r4
sys-apps/baselayout: 1.12.14-r1
sys-apps/sandbox:    2.4
sys-devel/autoconf:  2.65-r1
sys-devel/automake:  1.9.6-r3, 1.11.1
sys-devel/binutils:  2.20.1-r1
sys-devel/gcc:       4.4.5
sys-devel/gcc-config: 1.4.1
sys-devel/libtool:   2.2.10
sys-devel/make:      3.81-r2
virtual/os-headers:  2.6.36.1 (sys-kernel/linux-headers)
ACCEPT_KEYWORDS="ppc64"
ACCEPT_LICENSE="*"
CBUILD="powerpc64-unknown-linux-gnu"
CFLAGS="-O2 -pipe"
CHOST="powerpc64-unknown-linux-gnu"
CONFIG_PROTECT="/etc"
CONFIG_PROTECT_MASK="/etc/ca-certificates.conf /etc/env.d /etc/eselect/postgresql /etc/fonts/fonts.conf /etc/gconf /etc/sandbox.d /etc/terminfo"
CXXFLAGS="-O2 -pipe"
DISTDIR="/usr/portage/distfiles"
FEATURES="assume-digests binpkg-logs buildpkg distlocks fixlafiles fixpackages news nostrip parallel-fetch protect-owned sandbox sfperms split-elog split-log strict test unknown-features-warn unmerge-logs unmerge-orphans userfetch userpriv usersandbox"
GENTOO_MIRRORS="http://distfiles.gentoo.org"
LDFLAGS="-Wl,-O1 -Wl,--as-needed"
MAKEOPTS="-j8"
PKGDIR="/usr/portage/packages"
PORTAGE_CONFIGROOT="/"
PORTAGE_RSYNC_OPTS="--recursive --links --safe-links --perms --times --compress --force --whole-file --delete --stats --timeout=180 --exclude=/distfiles --exclude=/local --exclude=/packages"
PORTAGE_TMPDIR="/var/tmp"
PORTDIR="/usr/portage"
SYNC="rsync://rsync.gentoo.org/gentoo-portage"
USE="X a52 aac acl alsa altivec apache2 berkdb bluetooth branding bzip2 cairo cdr cli consolekit cracklib crypt cups cxx dbus device-mapper dri dts dvd dvdr eds emboss encode evo exif fam firefox flac fortran gdbm gdu gif gnome gnome-keyring gpm gstreamer gtk ibm iconv ipv6 jpeg lcms ldap libnotify mad mikmod mng modules mp3 mp4 mpeg mudflap nautilus ncurses nls nptl nptlonly ogg opengl openmp pam pango pcre pdf perl png policykit ppc64 ppds pppd python qt3support qt4 readline sdl session spell sqlite ssl startup-notification svg sysfs tcpd threads tiff truetype udev unicode usb vorbis xcb xml xorg xulrunner xv xvid zlib" ALSA_PCM_PLUGINS="adpcm alaw asym copy dmix dshare dsnoop empty extplug file hooks iec958 ioplug ladspa lfloat linear meter mmap_emul mulaw multi null plug rate route share shm softvol" APACHE2_MODULES="actions alias auth_basic authn_alias authn_anon authn_dbm authn_default authn_file authz_dbm authz_default authz_groupfile authz_host authz_owner authz_user autoindex cache cgi cgid dav dav_fs dav_lock deflate dir disk_cache env expires ext_filter file_cache filter headers include info log_config logio mem_cache mime mime_magic negotiation rewrite setenvif speling status unique_id userdir usertrack vhost_alias" CAMERAS="ptp2" COLLECTD_PLUGINS="df interface irq load memory rrdtool swap syslog" ELIBC="glibc" GPSD_PROTOCOLS="ashtech aivdm earthmate evermore fv18 garmin garmintxt gpsclock itrax mtk3301 nmea ntrip navcom oceanserver oldstyle oncore rtcm104v2 rtcm104v3 sirf superstar2 timing tsip tripmate tnt ubx" INPUT_DEVICES="evdev" KERNEL="linux" LCD_DEVICES="bayrad cfontz cfontz633 glk hd44780 lb216 lcdm001 mtxorb ncurses text" PHP_TARGETS="php5-3" RUBY_TARGETS="ruby18" USERLAND="GNU" VIDEO_CARDS="radeon" XTABLES_ADDONS="quota2 psd pknock lscan length2 ipv4options ipset ipp2p iface geoip fuzzy condition tee tarpit sysrq steal rawnat logmark ipmark dhcpmac delude chaos account" 
Unset:  CPPFLAGS, CTARGET, EMERGE_DEFAULT_OPTS, FFLAGS, INSTALL_MASK, LANG, LC_ALL, LINGUAS, PORTAGE_BUNZIP2_COMMAND, PORTAGE_COMPRESS, PORTAGE_COMPRESS_FLAGS, PORTAGE_RSYNC_EXTRA_OPTS, PORTDIR_OVERLAY
Comment 1 Kacper Kowalik (Xarthisius) (RETIRED) gentoo-dev 2011-02-19 11:09:12 UTC
Created attachment 263007 [details]
build.log
Comment 2 Dustin Polke 2011-11-04 09:23:59 UTC
Same on sparc with 0.10.35:

Running suite(s): tag support library
84%: Checks: 13, Failures: 2, Errors: 0
libs/tag.c:871:F:general:test_exif_tags_serialization_deserialization:0: Assertion 'n_recv == n_sent' failed
libs/tag.c:871:F:general:test_exif_multiple_tags:0: Assertion 'n_recv == n_sent' failed
FAIL: libs/tag
Running suite(s): video support library
100%: Checks: 8, Failures: 0, Errors: 0
PASS: libs/video
Running suite(s): xmpconfig interface
100%: Checks: 3, Failures: 0, Errors: 0
PASS: libs/xmpwriter
Running suite(s): GstLibsCpp
100%: Checks: 1, Failures: 0, Errors: 0
PASS: libs/gstlibscpp
Running suite(s): Pipelines
100%: Checks: 2, Failures: 0, Errors: 0
PASS: pipelines/simple-launch-lines
Running suite(s): streamheader
100%: Checks: 1, Failures: 0, Errors: 0
PASS: pipelines/streamheader
Running suite(s): baseaudiosrc
100%: Checks: 1, Failures: 0, Errors: 0
PASS: pipelines/basetime
Running suite(s): CapsfilterRenegotiation
100%: Checks: 1, Failures: 0, Errors: 0
PASS: pipelines/capsfilter-renegotiation
==========================================================================
1 of 43 tests failed
Please report to http://bugzilla.gnome.org/enter_bug.cgi?product=GStreamer
==========================================================================
make[3]: *** [check-TESTS] Error 1
make[3]: Leaving directory `/home/portage/portage/media-libs/gst-plugins-base-0.10.35/work/gst-plugins-base-0.10.35/tests/check'
make[2]: *** [check-am] Error 2
make[2]: Leaving directory `/home/portage/portage/media-libs/gst-plugins-base-0.10.35/work/gst-plugins-base-0.10.35/tests/check'
make[1]: *** [check-recursive] Error 1
make[1]: Leaving directory `/home/portage/portage/media-libs/gst-plugins-base-0.10.35/work/gst-plugins-base-0.10.35/tests'
make: *** [check-recursive] Error 1


Portage 2.1.10.11 (default/linux/sparc/experimental/multilib/server, gcc-4.5.3, glibc-2.12.2-r0, 2.6.39-gentoo-r3 sparc64)
=================================================================
                        System Settings
=================================================================
System uname: Linux-2.6.39-gentoo-r3-sparc64-sun4u-with-gentoo-2.0.3
Timestamp of tree: Fri, 04 Nov 2011 07:45:02 +0000
distcc 3.1 sparc-unknown-linux-gnu [disabled]
ccache version 2.4 [enabled]
app-shells/bash:          4.1_p9
dev-lang/python:          2.7.1-r1
dev-util/ccache:          2.4-r9
dev-util/cmake:           2.8.4-r1
dev-util/pkgconfig:       0.26
sys-apps/baselayout:      2.0.3
sys-apps/openrc:          0.8.3-r1
sys-apps/sandbox:         2.4
sys-devel/autoconf:       2.13, 2.68
sys-devel/automake:       1.11.1
sys-devel/binutils:       2.20.1-r1
sys-devel/gcc:            4.5.3-r1
sys-devel/gcc-config:     1.4.1-r1
sys-devel/libtool:        2.4-r1
sys-devel/make:           3.82-r1
sys-kernel/linux-headers: 2.6.36.1 (virtual/os-headers)
sys-libs/glibc:           2.12.2
Repositories: gentoo modified-ebuilds DuPol betagarden
ACCEPT_KEYWORDS="sparc"
ACCEPT_LICENSE="* -@EULA"
CBUILD="sparc-unknown-linux-gnu"
CFLAGS="-O2 -mcpu=ultrasparc -pipe -ggdb"
CHOST="sparc-unknown-linux-gnu"
CONFIG_PROTECT="/etc /usr/share/openvpn/easy-rsa"
CONFIG_PROTECT_MASK="/etc/ca-certificates.conf /etc/env.d /etc/fonts/fonts.conf /etc/gconf /etc/gentoo-release /etc/revdep-rebuild /etc/sandbox.d /etc/terminfo"
CXXFLAGS="-O2 -mcpu=ultrasparc -pipe -ggdb"
DISTDIR="/usr/portage/distfiles"
EMERGE_DEFAULT_OPTS="--ask --autounmask=n"
FEATURES="assume-digests binpkg-logs ccache collision-protect distlocks ebuild-locks fixlafiles fixpackages multilib-strict news parallel-fetch protect-owned sandbox sfperms splitdebug strict test unknown-features-warn unmerge-logs unmerge-orphans userfetch userpriv usersandbox"
FFLAGS=""
GENTOO_MIRRORS="ftp://mirror.netcologne.de/gentoo/     ftp://gentoo.tiscali.nl/pub/mirror/gentoo/     ftp://mirror.cambrium.nl/pub/os/linux/gentoo/     ftp://ftp.join.uni-muenster.de/pub/linux/distributions/gentoo     ftp://ftp6.uni-muenster.de/pub/linux/distributions/gentoo"
LDFLAGS="-Wl,-O1 -Wl,--as-needed"
LINGUAS="en de"
MAKEOPTS="-j3"
PKGDIR="/usr/portage/packages"
PORTAGE_COMPRESS=""
PORTAGE_CONFIGROOT="/"
PORTAGE_RSYNC_EXTRA_OPTS="--timeout=500"
PORTAGE_RSYNC_OPTS="--recursive --links --safe-links --perms --times --compress --force --whole-file --delete --stats --timeout=180 --exclude=/distfiles --exclude=/local --exclude=/packages"
PORTAGE_TMPDIR="/home/portage"
PORTDIR="/usr/portage"
PORTDIR_OVERLAY="/usr/local/portage/modified /var/lib/layman/DuPol /var/lib/layman/betagarden"
SYNC="rsync://rsync.de.gentoo.org/gentoo-portage"
USE="X acl admin bash-completion branding bzip2 cli coverpage cracklib crypt cups cxx dbus dri fortran gd git gpm iconv iproute2 javascript jpeg kerberos keyscrub logrotate loop-aes mime modules mudflap multilib nls nptl nptlonly openmp pam pcre png posix pppd readline sasl session sparc ssl sysfs syslog system-sqlite tcpd threads tiff truetype unicode userlocales xml xorg xvfb zlib" ALSA_PCM_PLUGINS="adpcm alaw asym copy dmix dshare dsnoop empty extplug file hooks iec958 ioplug ladspa lfloat linear meter mmap_emul mulaw multi null plug rate route share shm softvol" APACHE2_MODULES="auth_basic auth_core authn_file authz_core authz_host authz_user dav dir log_config mime unixd" CALLIGRA_FEATURES="kexi words flow plan stage tables krita karbon braindump" CAMERAS="ptp2" COLLECTD_PLUGINS="df interface irq load memory rrdtool swap syslog" ELIBC="glibc" GPSD_PROTOCOLS="ashtech aivdm earthmate evermore fv18 garmin garmintxt gpsclock itrax mtk3301 nmea ntrip navcom oceanserver oldstyle oncore rtcm104v2 rtcm104v3 sirf superstar2 timing tsip tripmate tnt ubx" INPUT_DEVICES="evdev" KERNEL="linux" LCD_DEVICES="bayrad cfontz cfontz633 glk hd44780 lb216 lcdm001 mtxorb ncurses text" LINGUAS="en de" PHP_TARGETS="php5-3" RUBY_TARGETS="ruby18" USERLAND="GNU" VIDEO_CARDS="mach64" XTABLES_ADDONS="quota2 psd pknock lscan length2 ipv4options ipset ipp2p iface geoip fuzzy condition tee tarpit sysrq steal rawnat logmark ipmark dhcpmac delude chaos account"
Unset:  CPPFLAGS, CTARGET, INSTALL_MASK, LANG, LC_ALL, PORTAGE_BUNZIP2_COMMAND, PORTAGE_COMPRESS_FLAGS
Comment 3 Gilles Dartiguelongue gentoo-dev 2013-01-20 18:00:38 UTC
Please try with 0.10.36.
Comment 4 Agostino Sarubbo gentoo-dev 2013-02-01 17:24:27 UTC
Created attachment 337614 [details]
test failures on PPC64

attaching other testfailures that happen on PPC64
Comment 5 Mart Raudsepp gentoo-dev 2019-06-22 08:48:00 UTC
gstreamer 0.10 has been finally removed from the tree. If this is an issue with the 1.0 series too, please file a new bug against that version.