Gentoo Websites Logo
Go to: Gentoo Home Documentation Forums Lists Bugs Planet Store Wiki Get Gentoo!
Bug 348613 - net-libs/webkit-gtk-1.3.7-r1::gnome: Compile failed
Summary: net-libs/webkit-gtk-1.3.7-r1::gnome: Compile failed
Status: VERIFIED NEEDINFO
Alias: None
Product: Gentoo Linux
Classification: Unclassified
Component: Current packages (show other bugs)
Hardware: AMD64 Linux
: High normal (vote)
Assignee: Gentoo Linux Gnome Desktop Team
URL:
Whiteboard:
Keywords:
Depends on:
Blocks:
 
Reported: 2010-12-13 12:55 UTC by fkhp
Modified: 2010-12-30 13:07 UTC (History)
0 users

See Also:
Package list:
Runtime testing required: ---


Attachments

Note You need to log in before you can comment on or make changes to this bug.
Description fkhp 2010-12-13 12:55:29 UTC
CXX    WebCore/platform/graphics/cairo/libwebkitgtk_1_0_la-OwnPtrCairo.lo
In file included from /usr/include/cairo/cairo-ft.h:46:0,
                 from WebCore/platform/graphics/cairo/OwnPtrCairo.cpp:24:
/usr/include/ft2build.h:56:38: fatal error: freetype/config/ftheader.h: No such file or directory
compilation terminated.
make[1]: *** [WebCore/platform/graphics/cairo/libwebkitgtk_1_0_la-OwnPtrCairo.lo] Error 1
make[1]: Leaving directory `/var/tmp/paludis/net-libs-webkit-gtk-1.3.7-r1/work/webkit-1.3.7'
make: *** [all] Error 2
/usr/libexec/paludis/utils/emake: emake returned error 2

!!! ERROR in net-libs/webkit-gtk-1.3.7-r1::gnome:
!!! In src_compile at line 4770
!!! Compile failed


Reproducible: Always
Comment 1 fkhp 2010-12-13 12:57:03 UTC
# grep fatal *gtk*out
1291851318-install-net-libs_webkit-gtk-1.3.7-r1:0::gnome.out:./WebCore/platform/graphics/transforms/TransformationMatrix.h:38:19: fatal error: cairo.h: No such file or directory
1291851839-install-gnome-extra_gtkhtml-3.91.3:3.14::gnome.out:../gtkhtml/htmltablecell.h:27:21: fatal error: gtk/gtk.h: No such file or directory
1291852845-install-net-libs_webkit-gtk-1.3.7-r1:0::gnome.out:WebCore/accessibility/gtk/AccessibilityObjectWrapperAtk.cpp:68:36: fatal error: libgail-util/gail-util.h: No such file or directory
1291856783-install-gnome-extra_gtkhtml-3.91.3:3.14::gnome.out:/usr/include/gtk-2.0/gdk/gdkapplaunchcontext.h:30:21: fatal error: gio/gio.h: No such file or directory
1291857026-install-net-libs_webkit-gtk-1.3.7-r1:0::gnome.out:/usr/include/ft2build.h:56:38: fatal error: freetype/config/ftheader.h: No such file or directory
1291861061-install-gnome-extra_gtkhtml-3.91.3:3.14::gnome.out:/usr/include/gtk-2.0/gdk/gdkapplaunchcontext.h:30:21: fatal error: gio/gio.h: No such file or directory
1291978867-install-net-libs_webkit-gtk-1.3.7-r1:0::gnome.out:/usr/include/ft2build.h:56:38: fatal error: freetype/config/ftheader.h: No such file or directory
1291984442-install-gnome-extra_gtkhtml-3.91.3:3.14::gnome.out:../gtkhtml/htmltablecell.h:27:21: fatal error: gtk/gtk.h: No such file or directory
Comment 2 fkhp 2010-12-13 12:59:06 UTC
add -I/usr/include/gtk-2.0 -I/usr/include/cairo to CFLAG will reduce the error messages.
Comment 3 Rafał Mużyło 2010-12-13 14:12:46 UTC
Full build log first.
Comment 4 Gilles Dartiguelongue gentoo-dev 2010-12-14 13:00:25 UTC
and emerge --info please.
Comment 5 Gilles Dartiguelongue gentoo-dev 2010-12-30 13:07:22 UTC
Due to lack of updated information in the last 2 weeks, there is no way we can further help you solve this problem. Thanks for reporting anyway.