Gentoo Websites Logo
Go to: Gentoo Home Documentation Forums Lists Bugs Planet Store Wiki Get Gentoo!
Bug 327925 - dev-ruby/qt4-qtruby-2.0.3[qting-edge]: compilation error
Summary: dev-ruby/qt4-qtruby-2.0.3[qting-edge]: compilation error
Alias: None
Product: Gentoo Linux
Classification: Unclassified
Component: [OLD] Development (show other bugs)
Hardware: All All
: Normal normal with 1 vote (vote)
Assignee: Qt Bug Alias
Depends on:
Reported: 2010-07-12 14:07 UTC by Vasiliy Yeremeyev
Modified: 2011-11-19 00:21 UTC (History)
0 users

See Also:
Package list:
Runtime testing required: ---


Note You need to log in before you can comment on or make changes to this bug.
Description Vasiliy Yeremeyev 2010-07-12 14:07:29 UTC
Extra quotation in smoke/qt/smokedata.cpp:6174:
{ ""com.trolltech.Qt.QGraphicsLayoutItem") inline void QGraphicsLayoutItem::setMinimumSize(qreal", 0, Smoke::t_voidp | Smoke::tf_stack },	//1

Corresponding error message:
[ 33%] Building CXX object smoke/qt/CMakeFiles/smokeqt.dir/smokedata.o
smoke/qt/smokedata.cpp:6174: error: expected ‘}’ before ‘com’
smoke/qt/smokedata.cpp:6174: error: expected ‘}’ before ‘com’
smoke/qt/smokedata.cpp:6174: error: expected ‘,’ or ‘;’ before ‘com’
smoke/qt/smokedata.cpp:6174: error: expected declaration before ‘}’ token
make[2]: *** [smoke/qt/CMakeFiles/smokeqt.dir/smokedata.o] Error 1
make[1]: *** [smoke/qt/CMakeFiles/smokeqt.dir/all] Error 2
make: *** [all] Error
Comment 1 Markos Chandras (RETIRED) gentoo-dev 2010-07-12 23:15:45 UTC
What version of Qt are you using?
Comment 2 Vasiliy Yeremeyev 2010-07-13 08:16:31 UTC
(In reply to comment #1)
> What version of Qt are you using?

3.3.8b-r2 (kde-sunset), 4.6.2-r1.
It seems to be c++ syntax error.
Comment 3 Davide Pesavento gentoo-dev 2011-11-19 00:21:52 UTC
Nobody from the qt team has shown any interest in maintaining qtruby for a long time. If you're sufficiently interested in this package, you're encouraged to become a proxy maintainer for it ( Until there isn't an active maintainer, I'm going to close all bugs that don't have a patch attached.