Gentoo Websites Logo
Go to: Gentoo Home Documentation Forums Lists Bugs Planet Store Wiki Get Gentoo!
Bug 324557 - make xconfig fails with gentoo-sources-2.6.34-r1
Summary: make xconfig fails with gentoo-sources-2.6.34-r1
Status: RESOLVED WORKSFORME
Alias: None
Product: Gentoo Linux
Classification: Unclassified
Component: [OLD] Core system (show other bugs)
Hardware: All Linux
: High normal (vote)
Assignee: Gentoo Linux bug wranglers
URL:
Whiteboard:
Keywords:
Depends on:
Blocks:
 
Reported: 2010-06-18 07:05 UTC by Bob Raitz
Modified: 2010-06-18 09:41 UTC (History)
0 users

See Also:
Package list:
Runtime testing required: ---


Attachments

Note You need to log in before you can comment on or make changes to this bug.
Description Bob Raitz 2010-06-18 07:05:21 UTC
When attempting to make xconfig while in the /usr/src/linux-2.6.34-gentoo-r1 directory, the script fails. Errors that occur to follow.

Reproducible: Always

Steps to Reproduce:
1. enter make xconfig
2. script fails
3. make xconfig fails



Expected Results:  
Expected to see make xconfig screen.

emerge --info
Portage 2.2_rc67 (default/linux/x86/10.0, gcc-4.3.2, glibc-2.11.2-r0, 2.6.34 i686)
=================================================================
System uname: Linux-2.6.34-i686-Intel-R-_Celeron-R-_M_CPU_440_@_1.86GHz-with-gentoo-1.12.13
Timestamp of tree: Fri, 18 Jun 2010 05:00:01 +0000
distcc 3.1 i686-pc-linux-gnu [enabled]
app-shells/bash:     4.1_p7
dev-java/java-config: 2.1.11
dev-lang/python:     2.6.5-r2, 3.1.2-r3
dev-util/cmake:      2.8.1-r2
sys-apps/baselayout: 1.12.13
sys-apps/sandbox:    2.2
sys-devel/autoconf:  2.13, 2.65
sys-devel/automake:  1.6.3, 1.8.5-r3, 1.9.6-r3, 1.10.3, 1.11.1
sys-devel/binutils:  2.20.1-r1
sys-devel/gcc:       4.3.2
sys-devel/gcc-config: 1.4.1
sys-devel/libtool:   2.2.10
virtual/os-headers:  2.6.34
ACCEPT_KEYWORDS="x86 ~x86"
ACCEPT_LICENSE="* -@EULA Broadcom dlj-1.1 AdobeFlash-10.1"
CBUILD="i686-pc-linux-gnu"
CFLAGS="-march=prescott -O2 -pipe"
CHOST="i686-pc-linux-gnu"
CONFIG_PROTECT="/etc /usr/kde/3.5/env /usr/kde/3.5/share/config /usr/kde/3.5/shutdown /usr/share/X11/xkb /usr/share/config"
CONFIG_PROTECT_MASK="/etc/ca-certificates.conf /etc/env.d /etc/env.d/java/ /etc/fonts/fonts.conf /etc/gconf /etc/php/apache2-php5/ext-active/ /etc/php/cgi-php5/ext-active/ /etc/php/cli-php5/ext-active/ /etc/revdep-rebuild /etc/sandbox.d /etc/terminfo"
CXXFLAGS="-march=prescott -O2 -pipe"
DISTDIR="/mnt/auto/storage/distfiles"
FEATURES="assume-digests distcc distlocks fixpackages news parallel-fetch preserve-libs protect-owned sandbox sfperms strict unmerge-logs unmerge-orphans userfetch"
GENTOO_MIRRORS="http://distfiles.gentoo.org"
LANG="en_US.UTF-8"
LC_ALL="en_US.UTF-8"
LDFLAGS="-Wl,-O1"
LINGUAS="en"
MAKEOPTS="-j8"
PKGDIR="/usr/portage/packages"
PORTAGE_CONFIGROOT="/"
PORTAGE_RSYNC_OPTS="--recursive --links --safe-links --perms --times --compress --force --whole-file --delete --stats --timeout=180 --exclude=/distfiles --exclude=/local --exclude=/packages"
PORTAGE_TMPDIR="/var/tmp"
PORTDIR="/usr/portage"
PORTDIR_OVERLAY="/var/lib/layman/x11 /var/lib/layman/kde-sunset /usr/local/portage /var/lib/layman/kde-sunset /var/lib/layman"
SYNC="rsync://192.168.0.130/gentoo-portage"
USE="X a52 aac acl acpi alsa ao apache2 aspell audiofile avi bash-completion berkdb bitmap-fonts bzip2 cairo cdr cli cracklib crypt css cups cxx dbus dlloader dri dts dv dvd dvdr dvdread eds encode fam fbcon ffmpeg fftw flac foomaticdb fortran gdbm gif gimp glib gnutls gpm gsl gtk hal iconv jpeg kde ladspa lame libsamplerate mad mikmod mmx modules mp3 mpeg mudflap mysql nas ncurses nls nptl nptlonly objc ogg opengl openmp oss pam pcre pdf perl php png pppd python qt3 quicktime readline reflection samba sdl session slang slp sndfile spell spl sqlite sse sse2 ssl svg swat sysfs tcpd theora tiff truetype udev unicode usb v4l v4l2 vhosts vidix vorbis wifi win32codecs wxwindows x264 x86 xine xml xorg xscreensaver xv xvid zlib" ALSA_CARDS="ali5451 als4000 atiixp atiixp-modem bt87x ca0106 cmipci emu10k1 emu10k1x ens1370 ens1371 es1938 es1968 fm801 hda-intel intel8x0 intel8x0m maestro3 trident usb-audio via82xx via82xx-modem ymfpci" ALSA_PCM_PLUGINS="adpcm alaw asym copy dmix dshare dsnoop empty extplug file hooks iec958 ioplug ladspa lfloat linear meter mmap_emul mulaw multi null plug rate route share shm softvol" APACHE2_MODULES="actions alias auth_basic auth_digest authn_anon authn_dbd authn_dbm authn_default authn_file authz_dbm authz_default authz_groupfile authz_host authz_owner authz_user autoindex cache dav dav_fs dav_lock dbd deflate dir disk_cache env expires ext_filter file_cache filter headers ident imagemap include info log_config logio mem_cache mime mime_magic negotiation proxy proxy_ajp proxy_balancer proxy_connect proxy_http rewrite setenvif so speling status unique_id userdir usertrack vhost_alias" ELIBC="glibc" INPUT_DEVICES="evdev synaptics" KERNEL="linux" LCD_DEVICES="bayrad cfontz cfontz633 glk hd44780 lb216 lcdm001 mtxorb ncurses text" LINGUAS="en" RUBY_TARGETS="ruby18" USERLAND="GNU" VIDEO_CARDS="intel v4l" XTABLES_ADDONS="quota2 psd pknock lscan length2 ipv4options ipset ipp2p iface geoip fuzzy condition tee tarpit sysrq steal rawnat logmark ipmark dhcpmac delude chaos account" 
Unset:  CPPFLAGS, CTARGET, EMERGE_DEFAULT_OPTS, FFLAGS, INSTALL_MASK, PORTAGE_COMPRESS, PORTAGE_COMPRESS_FLAGS, PORTAGE_RSYNC_EXTRA_OPTS
Comment 1 Bob Raitz 2010-06-18 07:11:32 UTC
Error information:

pappy-lap linux-2.6.34-gentoo-r1 # make xconfig
  HOSTCC  scripts/basic/fixdep
  HOSTCC  scripts/basic/docproc
  HOSTCC  scripts/basic/hash
  CHECK   qt
  HOSTCC  scripts/kconfig/conf.o
sed < scripts/kconfig/lkc_proto.h > scripts/kconfig/lkc_defs.h 's/P(\([^,]*\),.*/#define \1 (\*\1_p)/'
  HOSTCC  scripts/kconfig/kconfig_load.o
  HOSTCC  scripts/kconfig/kxgettext.o
  SHIPPED scripts/kconfig/zconf.tab.c
  SHIPPED scripts/kconfig/lex.zconf.c
  SHIPPED scripts/kconfig/zconf.hash.c
  HOSTCC  scripts/kconfig/zconf.tab.o
/usr/qt/3/bin/moc -i scripts/kconfig/qconf.h -o scripts/kconfig/qconf.moc
  HOSTCXX scripts/kconfig/qconf.o
scripts/kconfig/qconf.cc:7:26: error: q3mainwindow.h: No such file or directory
scripts/kconfig/qconf.cc:9:23: error: q3toolbar.h: No such file or directory
scripts/kconfig/qconf.cc:11:20: error: q3vbox.h: No such file or directory
scripts/kconfig/qconf.cc:13:24: error: q3listview.h: No such file or directory
scripts/kconfig/qconf.cc:14:27: error: q3textbrowser.h: No such file or directory
scripts/kconfig/qconf.cc:21:22: error: q3header.h: No such file or directory
scripts/kconfig/qconf.cc:22:26: error: q3filedialog.h: No such file or directory
scripts/kconfig/qconf.cc:23:26: error: q3dragobject.h: No such file or directory
scripts/kconfig/qconf.cc:26:29: error: QContextMenuEvent: No such file or directory
scripts/kconfig/qconf.cc:27:19: error: QPixmap: No such file or directory
scripts/kconfig/qconf.cc:28:23: error: QFocusEvent: No such file or directory
scripts/kconfig/qconf.cc:29:23: error: QMouseEvent: No such file or directory
scripts/kconfig/qconf.cc:30:23: error: QCloseEvent: No such file or directory
scripts/kconfig/qconf.cc:31:23: error: Q3ValueList: No such file or directory
scripts/kconfig/qconf.cc:32:21: error: QKeyEvent: No such file or directory
scripts/kconfig/qconf.cc:33:24: error: Q3HBoxLayout: No such file or directory
scripts/kconfig/qconf.cc:34:24: error: Q3VBoxLayout: No such file or directory
scripts/kconfig/qconf.cc:35:23: error: Q3PopupMenu: No such file or directory
In file included from scripts/kconfig/qconf.cc:40:
scripts/kconfig/qconf.h:46: error: ISO C++ forbids declaration of ‘Q3ValueList’ with no type
scripts/kconfig/qconf.h:46: error: expected ‘;’ before ‘<’ token
scripts/kconfig/qconf.h:47: error: expected ‘,’ or ‘...’ before ‘<’ token
scripts/kconfig/qconf.h:47: error: ISO C++ forbids declaration of ‘Q3ValueList’ with no type
scripts/kconfig/qconf.h:57: error: expected class-name before ‘{’ token
scripts/kconfig/qconf.h:141: error: ISO C++ forbids declaration of ‘Q3PopupMenu’ with no type
scripts/kconfig/qconf.h:141: error: expected ‘;’ before ‘*’ token
scripts/kconfig/qconf.h: In member function ‘ConfigView* ConfigList::parent() const’:
scripts/kconfig/qconf.h:65: error: incomplete type ‘Q3ListView’ used in nested name specifier
scripts/kconfig/qconf.h: In member function ‘ConfigItem* ConfigList::firstChild() const’:
scripts/kconfig/qconf.h:105: error: incomplete type ‘Q3ListView’ used in nested name specifier
scripts/kconfig/qconf.h: In member function ‘void ConfigList::addColumn(colIdx, const QString&)’:
scripts/kconfig/qconf.h:113: error: incomplete type ‘Q3ListView’ used in nested name specifier
scripts/kconfig/qconf.h: In member function ‘void ConfigList::removeColumn(colIdx)’:
scripts/kconfig/qconf.h:120: error: incomplete type ‘Q3ListView’ used in nested name specifier
scripts/kconfig/qconf.h: At global scope:
scripts/kconfig/qconf.h:148: error: expected class-name before ‘{’ token
scripts/kconfig/qconf.h: In constructor ‘ConfigItem::ConfigItem(Q3ListView*, ConfigItem*, KCMenu*, bool)’:
scripts/kconfig/qconf.h:152: error: type ‘Q3ListViewItem’ is not a direct base of ‘ConfigItem’
scripts/kconfig/qconf.h: In constructor ‘ConfigItem::ConfigItem(ConfigItem*, ConfigItem*, KCMenu*, bool)’:
scripts/kconfig/qconf.h:157: error: type ‘Q3ListViewItem’ is not a direct base of ‘ConfigItem’
scripts/kconfig/qconf.h: In constructor ‘ConfigItem::ConfigItem(Q3ListView*, ConfigItem*, bool)’:
scripts/kconfig/qconf.h:162: error: type ‘Q3ListViewItem’ is not a direct base of ‘ConfigItem’
scripts/kconfig/qconf.h: In member function ‘ConfigList* ConfigItem::listView() const’:
scripts/kconfig/qconf.h:175: error: incomplete type ‘Q3ListViewItem’ used in nested name specifier
scripts/kconfig/qconf.h: In member function ‘ConfigItem* ConfigItem::firstChild() const’:
scripts/kconfig/qconf.h:179: error: incomplete type ‘Q3ListViewItem’ used in nested name specifier
scripts/kconfig/qconf.h: In member function ‘ConfigItem* ConfigItem::nextSibling() const’:
scripts/kconfig/qconf.h:183: error: incomplete type ‘Q3ListViewItem’ used in nested name specifier
scripts/kconfig/qconf.h: In member function ‘void ConfigItem::setText(colIdx, const QString&)’:
scripts/kconfig/qconf.h:187: error: incomplete type ‘Q3ListViewItem’ used in nested name specifier
scripts/kconfig/qconf.h: In member function ‘QString ConfigItem::text(colIdx) const’:
scripts/kconfig/qconf.h:191: error: incomplete type ‘Q3ListViewItem’ used in nested name specifier
scripts/kconfig/qconf.h: In member function ‘void ConfigItem::setPixmap(colIdx, const QPixmap&)’:
scripts/kconfig/qconf.h:195: error: incomplete type ‘Q3ListViewItem’ used in nested name specifier
scripts/kconfig/qconf.h: In member function ‘const QPixmap* ConfigItem::pixmap(colIdx) const’:
scripts/kconfig/qconf.h:199: error: incomplete type ‘Q3ListViewItem’ used in nested name specifier
scripts/kconfig/qconf.h: At global scope:
scripts/kconfig/qconf.h:225: error: expected class-name before ‘{’ token
scripts/kconfig/qconf.h:256: error: expected class-name before ‘{’ token
scripts/kconfig/qconf.h:279: error: ISO C++ forbids declaration of ‘Q3PopupMenu’ with no type
scripts/kconfig/qconf.h:279: error: expected ‘;’ before ‘*’ token
scripts/kconfig/qconf.h:307: error: expected class-name before ‘{’ token
scripts/kconfig/qconf.h:339: error: ISO C++ forbids declaration of ‘Q3ToolBar’ with no type
scripts/kconfig/qconf.h:339: error: expected ‘;’ before ‘*’ token
In file included from scripts/kconfig/qconf.cc:42:
scripts/kconfig/qconf.moc: In static member function ‘static QMetaObject* ConfigList::staticMetaObject()’:
scripts/kconfig/qconf.moc:52: error: incomplete type ‘Q3ListView’ used in nested name specifier
scripts/kconfig/qconf.moc: In member function ‘virtual void* ConfigList::qt_cast(const char*)’:
scripts/kconfig/qconf.moc:116: error: incomplete type ‘Q3ListView’ used in nested name specifier
In file included from scripts/kconfig/qconf.cc:42:
scripts/kconfig/qconf.moc: In member function ‘void ConfigList::menuChanged(KCMenu*)’:
scripts/kconfig/qconf.moc:125: error: ‘signalsBlocked’ was not declared in this scope
scripts/kconfig/qconf.moc:127: error: ‘receivers’ was not declared in this scope
scripts/kconfig/qconf.moc:132: error: ‘activate_signal’ was not declared in this scope
scripts/kconfig/qconf.moc: In member function ‘void ConfigList::menuSelected(KCMenu*)’:
scripts/kconfig/qconf.moc:138: error: ‘signalsBlocked’ was not declared in this scope
scripts/kconfig/qconf.moc:140: error: ‘receivers’ was not declared in this scope
scripts/kconfig/qconf.moc:145: error: ‘activate_signal’ was not declared in this scope
scripts/kconfig/qconf.moc: In member function ‘void ConfigList::parentSelected()’:
scripts/kconfig/qconf.moc:151: error: ‘activate_signal’ was not declared in this scope
scripts/kconfig/qconf.moc: In member function ‘void ConfigList::gotFocus(KCMenu*)’:
scripts/kconfig/qconf.moc:157: error: ‘signalsBlocked’ was not declared in this scope
scripts/kconfig/qconf.moc:159: error: ‘receivers’ was not declared in this scope
scripts/kconfig/qconf.moc:164: error: ‘activate_signal’ was not declared in this scope
scripts/kconfig/qconf.moc: In member function ‘virtual bool ConfigList::qt_invoke(int, QUObject*)’:
scripts/kconfig/qconf.moc:177: error: incomplete type ‘Q3ListView’ used in nested name specifier
scripts/kconfig/qconf.moc: In member function ‘virtual bool ConfigList::qt_emit(int, QUObject*)’:
scripts/kconfig/qconf.moc:190: error: incomplete type ‘Q3ListView’ used in nested name specifier
scripts/kconfig/qconf.moc: In member function ‘virtual bool ConfigList::qt_property(int, int, QVariant*)’:
scripts/kconfig/qconf.moc:198: error: incomplete type ‘Q3ListView’ used in nested name specifier
scripts/kconfig/qconf.moc: In static member function ‘static QMetaObject* ConfigView::staticMetaObject()’:
scripts/kconfig/qconf.moc:310: error: incomplete type ‘Q3VBox’ used in nested name specifier
scripts/kconfig/qconf.moc: In member function ‘virtual void* ConfigView::qt_cast(const char*)’:
scripts/kconfig/qconf.moc:372: error: incomplete type ‘Q3VBox’ used in nested name specifier
scripts/kconfig/qconf.moc: In member function ‘void ConfigView::showAllChanged(bool)’:
scripts/kconfig/qconf.moc:378: error: ‘activate_signal_bool’ was not declared in this scope
scripts/kconfig/qconf.moc: In member function ‘void ConfigView::showNameChanged(bool)’:
scripts/kconfig/qconf.moc:384: error: ‘activate_signal_bool’ was not declared in this scope
scripts/kconfig/qconf.moc: In member function ‘void ConfigView::showRangeChanged(bool)’:
scripts/kconfig/qconf.moc:390: error: ‘activate_signal_bool’ was not declared in this scope
scripts/kconfig/qconf.moc: In member function ‘void ConfigView::showDataChanged(bool)’:
scripts/kconfig/qconf.moc:396: error: ‘activate_signal_bool’ was not declared in this scope
scripts/kconfig/qconf.moc: In member function ‘virtual bool ConfigView::qt_invoke(int, QUObject*)’:
scripts/kconfig/qconf.moc:407: error: incomplete type ‘Q3VBox’ used in nested name specifier
scripts/kconfig/qconf.moc: In member function ‘virtual bool ConfigView::qt_emit(int, QUObject*)’:
scripts/kconfig/qconf.moc:420: error: incomplete type ‘Q3VBox’ used in nested name specifier
scripts/kconfig/qconf.moc: In member function ‘virtual bool ConfigView::qt_property(int, int, QVariant*)’:
scripts/kconfig/qconf.moc:428: error: incomplete type ‘Q3VBox’ used in nested name specifier
scripts/kconfig/qconf.moc: In static member function ‘static QMetaObject* ConfigInfoView::staticMetaObject()’:
scripts/kconfig/qconf.moc:467: error: incomplete type ‘Q3TextBrowser’ used in nested name specifier
scripts/kconfig/qconf.moc: In member function ‘virtual void* ConfigInfoView::qt_cast(const char*)’:
scripts/kconfig/qconf.moc:516: error: incomplete type ‘Q3TextBrowser’ used in nested name specifier
scripts/kconfig/qconf.moc: In member function ‘void ConfigInfoView::showDebugChanged(bool)’:
scripts/kconfig/qconf.moc:522: error: ‘activate_signal_bool’ was not declared in this scope
scripts/kconfig/qconf.moc: In member function ‘void ConfigInfoView::menuSelected(KCMenu*)’:
scripts/kconfig/qconf.moc:528: error: ‘signalsBlocked’ was not declared in this scope
scripts/kconfig/qconf.moc:530: error: ‘receivers’ was not declared in this scope
scripts/kconfig/qconf.moc:535: error: ‘activate_signal’ was not declared in this scope
scripts/kconfig/qconf.moc: In member function ‘virtual bool ConfigInfoView::qt_invoke(int, QUObject*)’:
scripts/kconfig/qconf.moc:546: error: incomplete type ‘Q3TextBrowser’ used in nested name specifier
scripts/kconfig/qconf.moc: In member function ‘virtual bool ConfigInfoView::qt_emit(int, QUObject*)’:
scripts/kconfig/qconf.moc:557: error: incomplete type ‘Q3TextBrowser’ used in nested name specifier
scripts/kconfig/qconf.moc: In member function ‘virtual bool ConfigInfoView::qt_property(int, int, QVariant*)’:
scripts/kconfig/qconf.moc:565: error: incomplete type ‘Q3TextBrowser’ used in nested name specifier
scripts/kconfig/qconf.moc: In static member function ‘static QMetaObject* ConfigMainWindow::staticMetaObject()’:
scripts/kconfig/qconf.moc:689: error: ‘Q3MainWindow’ has not been declared
scripts/kconfig/qconf.moc: In member function ‘virtual void* ConfigMainWindow::qt_cast(const char*)’:
scripts/kconfig/qconf.moc:743: error: ‘Q3MainWindow’ has not been declared
scripts/kconfig/qconf.moc: In member function ‘virtual bool ConfigMainWindow::qt_invoke(int, QUObject*)’:
scripts/kconfig/qconf.moc:764: error: ‘Q3MainWindow’ has not been declared
scripts/kconfig/qconf.moc: In member function ‘virtual bool ConfigMainWindow::qt_emit(int, QUObject*)’:
scripts/kconfig/qconf.moc:771: error: ‘Q3MainWindow’ has not been declared
scripts/kconfig/qconf.moc: In member function ‘virtual bool ConfigMainWindow::qt_property(int, int, QVariant*)’:
scripts/kconfig/qconf.moc:777: error: ‘Q3MainWindow’ has not been declared
scripts/kconfig/qconf.cc: At global scope:
scripts/kconfig/qconf.cc:68: error: expected constructor, destructor, or type conversion before ‘<’ token
make[1]: *** [scripts/kconfig/qconf.o] Error 1
make: *** [xconfig] Error 2
Comment 2 Bob Raitz 2010-06-18 07:16:40 UTC
The problem also occurs with x86_64. Here is the emerge --info for that machine:

core-too ~ # emerge --info
Portage 2.2_rc67 (default/linux/amd64/10.0, gcc-4.3.2, glibc-2.11.2-r0, 2.6.34 x86_64)
=================================================================
System uname: Linux-2.6.34-x86_64-Intel-R-_Core-TM-2_Duo_CPU_E6550_@_2.33GHz-with-gentoo-2.0.1
Timestamp of tree: Fri, 18 Jun 2010 05:00:01 +0000
distcc 3.1 x86_64-pc-linux-gnu [disabled]
app-shells/bash:     4.1_p7
dev-java/java-config: 1.3.7-r1, 2.1.11
dev-lang/python:     2.6.5-r2, 3.1.2-r3
dev-util/cmake:      2.8.1-r2
sys-apps/baselayout: 2.0.1
sys-apps/openrc:     0.6.1-r1
sys-apps/sandbox:    2.2
sys-devel/autoconf:  2.13, 2.65
sys-devel/automake:  1.4_p6, 1.5, 1.6.3, 1.7.9-r1, 1.8.5-r4, 1.9.6-r3, 1.10.3, 1.11.1
sys-devel/binutils:  2.20.1-r1
sys-devel/gcc:       4.3.2
sys-devel/gcc-config: 1.4.1
sys-devel/libtool:   2.2.10
virtual/os-headers:  2.6.34
ACCEPT_KEYWORDS="amd64 ~amd64"
ACCEPT_LICENSE="* -@EULA dlj-1.1 googleearth AdobeFlash-10"
CBUILD="x86_64-pc-linux-gnu"
CFLAGS="-O2 -march=core2 -pipe"
CHOST="x86_64-pc-linux-gnu"
CONFIG_PROTECT="/etc /usr/kde/3.5/env /usr/kde/3.5/share/config /usr/kde/3.5/shutdown /usr/share/X11/xkb /usr/share/config"
CONFIG_PROTECT_MASK="/etc/ca-certificates.conf /etc/env.d /etc/env.d/java/ /etc/fonts/fonts.conf /etc/gconf /etc/gentoo-release /etc/php/apache2-php5/ext-active/ /etc/php/cgi-php5/ext-active/ /etc/php/cli-php5/ext-active/ /etc/revdep-rebuild /etc/sandbox.d /etc/terminfo"
CXXFLAGS="-O2 -march=core2 -pipe"
DISTDIR="/mnt/seeds/storage/distfiles"
FEATURES="assume-digests distlocks fixpackages news parallel-fetch preserve-libs protect-owned sandbox sfperms strict unmerge-logs unmerge-orphans userfetch"
GENTOO_MIRRORS="http://distfiles.gentoo.org"
LANG="en_US.UTF-8"
LC_ALL="en_US.UTF-8"
LDFLAGS="-Wl,-O1"
LINGUAS="en"
MAKEOPTS="-j4"
PKGDIR="/usr/portage/packages"
PORTAGE_CONFIGROOT="/"
PORTAGE_RSYNC_OPTS="--recursive --links --safe-links --perms --times --compress --force --whole-file --delete --stats --timeout=180 --exclude=/distfiles --exclude=/local --exclude=/packages"
PORTAGE_TMPDIR="/var/tmp"
PORTDIR="/usr/portage"
PORTDIR_OVERLAY="/usr/local/portage /usr/local/portage/layman/kde-sunset"
SYNC="rsync://rsync.gentoo.org/gentoo-portage"
USE="X a52 aac acl acpi alsa amd64 apache2 audiofile avi bash-completion berkdb bitmap-fonts bzip2 cairo cdr cli cracklib crypt css ctype cups cxx dbus dlloader dri drm dvd dvdr dvdread emboss encode fam ffmpeg fftw filter flac foomaticdb fortran gdbm gif glib gnutls gpm gsl gtk hal iconv jpeg kde kdgraphics ladspa lame libsamplerate libwww live lm_sensors mad mikmod mmx modules mp3 mpeg mudflap multilib mysql nas ncurses nls nptl nptlonly objc ogg opengl openmp pam pcre pdcre pdf pdflib perl php png ppds pppd python qt3 qt3support quicktime readline reflection samba sdl session slang slp sndfile spell spl sqlite sse sse2 ssl ssse3 svg swat sysfs tcpd theora tiff truetype udev unicode v4l v4l2 vhosts vorbis wxwindows x264 xml xorg xscreensaver xv xvid zlib" ALSA_CARDS="ice1712" ALSA_PCM_PLUGINS="adpcm alaw asym copy dmix dshare dsnoop empty extplug file hooks iec958 ioplug ladspa lfloat linear meter mmap_emul mulaw multi null plug rate route share shm softvol" APACHE2_MODULES="actions alias auth_basic auth_digest authn_anon authn_dbd authn_dbm authn_default authn_file authz_dbm authz_default authz_groupfile authz_host authz_owner authz_user autoindex cache dav dav_fs dav_lock dbd deflate dir disk_cache env expires ext_filter file_cache filter headers ident imagemap include info log_config logio mem_cache mime mime_magic negotiation proxy proxy_ajp proxy_balancer proxy_connect proxy_http rewrite setenvif so speling status unique_id userdir usertrack vhost_alias" ELIBC="glibc" INPUT_DEVICES="evdev" KERNEL="linux" LCD_DEVICES="bayrad cfontz cfontz633 glk hd44780 lb216 lcdm001 mtxorb ncurses text" LINGUAS="en" RUBY_TARGETS="ruby18" USERLAND="GNU" VIDEO_CARDS="nvidia v4l" XTABLES_ADDONS="quota2 psd pknock lscan length2 ipv4options ipset ipp2p iface geoip fuzzy condition tee tarpit sysrq steal rawnat logmark ipmark dhcpmac delude chaos account" 
Unset:  CPPFLAGS, CTARGET, EMERGE_DEFAULT_OPTS, FFLAGS, INSTALL_MASK, PORTAGE_COMPRESS, PORTAGE_COMPRESS_FLAGS, PORTAGE_RSYNC_EXTRA_OPTS
Comment 3 Samuli Suominen gentoo-dev 2010-06-18 07:24:56 UTC
(In reply to comment #1)
> scripts/kconfig/qconf.cc:7:26: error: q3mainwindow.h: No such file or 

$ qfile q3mainwindow.h
x11-libs/qt-qt3support (/usr/include/qt4/Qt3Support/q3mainwindow.h)
x11-libs/qt-qt3support (/usr/include/qt4/Qt/q3mainwindow.h)

Missing Qt3support in your Qt4 installation.
Comment 4 Bob Raitz 2010-06-18 08:52:28 UTC
(In reply to comment #3)
> (In reply to comment #1)
> > scripts/kconfig/qconf.cc:7:26: error: q3mainwindow.h: No such file or 
> 
> $ qfile q3mainwindow.h
> x11-libs/qt-qt3support (/usr/include/qt4/Qt3Support/q3mainwindow.h)
> x11-libs/qt-qt3support (/usr/include/qt4/Qt/q3mainwindow.h)
> 
> Missing Qt3support in your Qt4 installation.


Really? So why does every other version work for me?


Comment 5 Samuli Suominen gentoo-dev 2010-06-18 09:41:32 UTC
(In reply to comment #4)
> (In reply to comment #3)
> > (In reply to comment #1)
> > > scripts/kconfig/qconf.cc:7:26: error: q3mainwindow.h: No such file or 
> > 
> > $ qfile q3mainwindow.h
> > x11-libs/qt-qt3support (/usr/include/qt4/Qt3Support/q3mainwindow.h)
> > x11-libs/qt-qt3support (/usr/include/qt4/Qt/q3mainwindow.h)
> > 
> > Missing Qt3support in your Qt4 installation.
> 
> 
> Really? So why does every other version work for me?
> 

reading ChangeLog often helps :-)

*gentoo-sources-2.6.34-r1 (16 Jun 2010)

  16 Jun 2010; Mike Pagano <mpagano@gentoo.org>
  +gentoo-sources-2.6.34-r1.ebuild:
  qt4 xconfig, fix for apci lid open error in nouveau driver and a fix for
  some errors issued by modpost in the vfb driver

^^^ patch was added to convert xconfig from qt3 to qt4's qt-qt3support