Gentoo Websites Logo
Go to: Gentoo Home Documentation Forums Lists Bugs Planet Store Wiki Get Gentoo!
Bug 297917 - app-office/gnucash-2.2.9-r1 doesn't compile
Summary: app-office/gnucash-2.2.9-r1 doesn't compile
Status: RESOLVED NEEDINFO
Alias: None
Product: Gentoo Linux
Classification: Unclassified
Component: Current packages (show other bugs)
Hardware: x86 Linux
: High normal (vote)
Assignee: Torsten Veller (RETIRED)
URL:
Whiteboard:
Keywords:
Depends on:
Blocks:
 
Reported: 2009-12-22 17:54 UTC by gvwolf3d
Modified: 2011-01-28 16:49 UTC (History)
3 users (show)

See Also:
Package list:
Runtime testing required: ---


Attachments
build log (app-office:gnucash-2.2.9-r1:20091222-174812.log,343.71 KB, text/plain)
2009-12-22 18:02 UTC, gvwolf3d
Details

Note You need to log in before you can comment on or make changes to this bug.
Description gvwolf3d 2009-12-22 17:54:57 UTC
Failed to emerge app-office/gnucash-2.2.9-r1
Comment 1 gvwolf3d 2009-12-22 17:55:59 UTC
Portage 2.1.6.13 (default/linux/x86/10.0, gcc-4.3.2, glibc-2.9_p20081201-r2, 2.6.25.14 i686)
=================================================================
System uname: Linux-2.6.25.14-i686-Intel-R-_Pentium-R-_M_processor_1.80GHz-with-gentoo-1.12.13
Timestamp of tree: Tue, 22 Dec 2009 13:00:01 +0000
app-shells/bash:     4.0_p28
dev-java/java-config: 1.3.7, 2.1.9-r1
dev-lang/python:     2.4.4-r4, 2.5.4-r3, 2.6.2-r1
dev-python/pycrypto: 2.0.1-r6
dev-util/cmake:      2.6.4-r3
sys-apps/baselayout: 1.12.13
sys-apps/sandbox:    1.6-r2
sys-devel/autoconf:  2.13, 2.63-r1
sys-devel/automake:  1.4_p6, 1.5, 1.6.3, 1.7.9-r1, 1.8.5-r3, 1.9.6-r2, 1.10.2
sys-devel/binutils:  2.18-r3
sys-devel/gcc-config: 1.4.1
sys-devel/libtool:   2.2.6a
virtual/os-headers:  2.6.27-r2
ACCEPT_KEYWORDS="x86"
CBUILD="i686-pc-linux-gnu"
CFLAGS="-march=pentium-m -O2 -pipe -fomit-frame-pointer"
CHOST="i686-pc-linux-gnu"
CONFIG_PROTECT="/etc /usr/share/X11/xkb /usr/share/config"
CONFIG_PROTECT_MASK="/etc/ca-certificates.conf /etc/env.d /etc/env.d/java/ /etc/fonts/fonts.conf /etc/gconf /etc/php/apache2-php5/ext-active/ /etc/php/cgi-php5/ext-active/ /etc/php/cli-php5/ext-active/ /etc/revdep-rebuild /etc/sandbox.d /etc/terminfo /etc/udev/rules.d"
CXXFLAGS="-march=pentium-m -O2 -pipe -fomit-frame-pointer"
DISTDIR="/usr/portage/distfiles"
FEATURES="distlocks fixpackages parallel-fetch protect-owned sandbox sfperms strict unmerge-orphans userfetch"
GENTOO_MIRRORS="http://distfiles.gentoo.org http://distro.ibiblio.org/pub/linux/distributions/gentoo"
LANG="de_DE@euro"
LC_ALL="de_DE@euro"
LDFLAGS="-Wl,-O1"
LINGUAS="de en"
MAKEOPTS="-j2"
PKGDIR="/usr/portage/packages"
PORTAGE_CONFIGROOT="/"
PORTAGE_RSYNC_OPTS="--recursive --links --safe-links --perms --times --compress --force --whole-file --delete --stats --timeout=180 --exclude=/distfiles --exclude=/local --exclude=/packages"
PORTAGE_TMPDIR="/var/tmp"
PORTDIR="/usr/portage"
SYNC="rsync://rsync.gentoo.org/gentoo-portage"
USE="G3 X a52 aac aalib acl additions apache2 audacious authdaemond berkdb bzip2 cli cpudetection cracklib crypt cups cxx dbus de_tvtoday directfb dri dv dvb dvdnav dvi encode fame filepicker fortran gdbm gimp gimpprint gnome gpm hbci iconv imagemagick ipv6 java javascript kde lirc lzo mjpeg modules mplayer mudflap mysql ncurses nls nptl nptlonly nsplugin opengl openmp pam pcre perl ppds pppd python qt3 qt3support readline reflection rtc sasl session slang spl sql sse-filters ssl svg sysfs tcpd theora unicode v4l v4l2 vcd vdr webkit wma x86 xorg xvid zlib" ALSA_CARDS="intel8x0" ALSA_PCM_PLUGINS="adpcm alaw asym copy dmix dshare dsnoop empty extplug file hooks iec958 ioplug ladspa lfloat linear meter mmap_emul mulaw multi null plug rate route share shm softvol" APACHE2_MODULES="access auth auth_dbm auth_anon auth_digest alias file-cache echo charset-lite cache disk-cache mem-cache ext-filter case_filter case-filter-in deflate mime-magic cern-meta expires headers usertrack unique-id proxy proxy-connect proxy-ftp proxy-http info include cgi cgid dav dav-fs vhost-alias speling rewrite log_config logio env setenvif mime status autoindex asis negotiation dir imap actions userdir so filter authz_host" ELIBC="glibc" INPUT_DEVICES="keyboard mouse" KERNEL="linux" LCD_DEVICES="bayrad cfontz cfontz633 glk hd44780 lb216 lcdm001 mtxorb ncurses text" LINGUAS="de en" RUBY_TARGETS="ruby18" USERLAND="GNU" VIDEO_CARDS="radeon intel vesa"
Unset:  CPPFLAGS, CTARGET, EMERGE_DEFAULT_OPTS, FFLAGS, INSTALL_MASK, PORTAGE_COMPRESS, PORTAGE_COMPRESS_FLAGS, PORTAGE_RSYNC_EXTRA_OPTS, PORTDIR_OVERLAY

Comment 2 gvwolf3d 2009-12-22 17:58:45 UTC
/bin/sh ../../libtool --tag=CC   --mode=compile i686-pc-linux-gnu-gcc -DHAVE_CONFIG_H -I.
...
/libgsf-1 -I/usr/include/libxml2 -I/usr/include/gtk-2.0 -I/usr/include/libglade-2.0 -I/usr/include/libart-2.0 -I/usr/include/cairo -I/usr/include/pango-1.0 -I/usr
/lib/gtk-2.0/include -I/usr/include/atk-1.0 -I/usr/include/pixman-1 -I/usr/include/freetype2 -I/usr/include/directfb -I/usr/include/libpng12 -Wdeclaration-after-s
tatement -Wno-pointer-sign -D_FORTIFY_SOURCE=2 -march=pentium-m -pipe -fomit-frame-pointer -g -Wall -Wunused -Wmissing-prototypes -Wmissing-declarations -Wno-unus
ed -MT druid-utils.lo -MD -MP -MF .deps/druid-utils.Tpo -c druid-utils.c  -fPIC -DPIC -o .libs/druid-utils.o
In file included from druid-utils.c:30:
druid-utils.h:29: Fehler: expected »)« before »*« token
druid-utils.h:32: Fehler: expected »)« before »*« token
druid-utils.h:33: Fehler: expected »)« before »*« token
druid-utils.c:35: Fehler: expected »)« before »*« token
druid-utils.c:69: Fehler: expected »)« before »*« token
druid-utils.c:99: Fehler: expected »)« before »*« token
make[5]: *** [druid-utils.lo] Fehler 1
make[5]: Leaving directory `/var/tmp/portage/app-office/gnucash-2.2.9-r1/work/gnucash-2.2.9/src/gnome-utils'
make[4]: *** [all-recursive] Fehler 1
make[4]: Leaving directory `/var/tmp/portage/app-office/gnucash-2.2.9-r1/work/gnucash-2.2.9/src/gnome-utils'
make[3]: *** [all] Fehler 2
make[3]: Leaving directory `/var/tmp/portage/app-office/gnucash-2.2.9-r1/work/gnucash-2.2.9/src/gnome-utils'
make[2]: *** [all-recursive] Fehler 1
make[2]: Leaving directory `/var/tmp/portage/app-office/gnucash-2.2.9-r1/work/gnucash-2.2.9/src'
make[1]: *** [all-recursive] Fehler 1
make[1]: Leaving directory `/var/tmp/portage/app-office/gnucash-2.2.9-r1/work/gnucash-2.2.9'
make: *** [all] Fehler 2
 * 
 * ERROR: app-office/gnucash-2.2.9-r1 failed.
 * Call stack:
 *               ebuild.sh, line   49:  Called src_compile
 *             environment, line 2814:  Called gnome2_src_compile
 *             environment, line 2178:  Called die
 * The specific snippet of code:
 *       emake || die "compile failure"
 *  The die message:
 *   compile failure
 * 
 * If you need support, post the topmost build error, and the call stack if relevant.
 * A complete build log is located at '/var/log/portage/app-office:gnucash-2.2.9-r1:20091222-174812.log'.
 * The ebuild environment file is located at '/var/tmp/portage/app-office/gnucash-2.2.9-r1/temp/environment'.
 * 
Comment 3 gvwolf3d 2009-12-22 18:02:22 UTC
Created attachment 213784 [details]
build log

complete build log
Comment 4 Gilles Dartiguelongue gentoo-dev 2010-12-23 11:05:22 UTC
Could you give a shot at a more recent gnucash revision, it if still fails, please attach full build.log in english (LC_ALL="C" emerge -1 gnucash).
Comment 5 Gilles Dartiguelongue gentoo-dev 2011-01-28 16:49:24 UTC
Please get back to us.