Gentoo Websites Logo
Go to: Gentoo Home Documentation Forums Lists Bugs Planet Store Wiki Get Gentoo!
Bug 294371 - dev-perl/XML-AutoWriter-0.40 fails tests
Summary: dev-perl/XML-AutoWriter-0.40 fails tests
Status: RESOLVED TEST-REQUEST
Alias: None
Product: Gentoo Linux
Classification: Unclassified
Component: New packages (show other bugs)
Hardware: All Linux
: High normal (vote)
Assignee: Gentoo Perl team
URL:
Whiteboard:
Keywords:
Depends on:
Blocks: perl-testfailure
  Show dependency tree
 
Reported: 2009-11-24 09:23 UTC by Patrick Lauer
Modified: 2014-10-10 16:35 UTC (History)
1 user (show)

See Also:
Package list:
Runtime testing required: ---


Attachments
Build log (XML-AutoWriter-0.40:20091222-200526.log,6.26 KB, text/plain)
2009-12-22 22:20 UTC, Diego Elio Pettenò (RETIRED)
Details

Note You need to log in before you can comment on or make changes to this bug.
Description Patrick Lauer gentoo-dev 2009-11-24 09:23:27 UTC
>>> Compiling source in /var/tmp/portage/dev-perl/XML-AutoWriter-0.40/work/XML-AutoWriter-0.4 ...
 * Using ExtUtils::MakeMaker
Checking if your kit is complete...
Looks good
Warning: prerequisite ExtUtils::MakeMaker 6.42 not found. We have 6.30.
Writing Makefile for XML::AutoWriter
make -j5 OTHERLDFLAGS=-Wl,-O1
cp lib/XML/Doctype.pm blib/lib/XML/Doctype.pm
cp lib/XML/ValidWriter.pm blib/lib/XML/ValidWriter.pm
cp lib/XML/Doctype/ElementDecl.pm blib/lib/XML/Doctype/ElementDecl.pm
cp lib/XML/AutoWriter.pm blib/lib/XML/AutoWriter.pm
cp lib/XML/Doctype/AttDef.pm blib/lib/XML/Doctype/AttDef.pm
>>> Source compiled.
make -j5 test TEST_VERBOSE=0
PERL_DL_NONLAZY=1 /usr/bin/perl5.8.8 "-MExtUtils::Command::MM" "-e" "test_harness(0, 'inc', 'blib/lib', 'blib/arch')" t/auto.t t/cm_re.t t/dtd.t t/escape.t t/foo.t t/valid.t
t/auto......^M                                                                             ^Mt/auto......ok 1/18Not an ARRAY reference at /var/tmp/portage/dev-perl/XML-AutoWriter-0.40/work/XML-AutoWriter-0.4/blib/lib/XML/ValidWriter.pm line 313.
^M                                                                             ^Mt/auto......dubious
        Test returned status 2 (wstat 512, 0x200)
DIED. FAILED tests 2-18
        Failed 17/18 tests, 5.56% okay
t/cm_re.....^M                                                                             ^Mt/cm_re.....ok 1/9^M                                                                             ^Mt/cm_re.....ok
        9/9 skipped: undo deprecation warning
t/dtd.......Couldn't load LWP based external entity handler
Switching to file-based external entity handler
 (To avoid this message, use NoLWP option to XML::Parser)
^M                                                                             ^Mt/dtd.......ok 1/55^M                                                                             ^Mt/dtd.......ok
t/escape....^M                                                                             ^Mt/escape....ok 1/83Not an ARRAY reference at /var/tmp/portage/dev-perl/XML-AutoWriter-0.40/work/XML-AutoWriter-0.4/blib/lib/XML/ValidWriter.pm line 313.
^M                                                                             ^Mt/escape....dubious
        Test returned status 255 (wstat 65280, 0xff00)
DIED. FAILED tests 3-83
        Failed 81/83 tests, 2.41% okay
t/foo.......Not an ARRAY reference at /var/tmp/portage/dev-perl/XML-AutoWriter-0.40/work/XML-AutoWriter-0.4/blib/lib/XML/ValidWriter.pm line 313.
^M                                                                             ^Mt/foo.......dubious
        Test returned status 255 (wstat 65280, 0xff00)
DIED. FAILED test 1
        Failed 1/1 tests, 0.00% okay
t/valid.....^M                                                                             ^Mt/valid.....ok 1/16Not an ARRAY reference at /var/tmp/portage/dev-perl/XML-AutoWriter-0.40/work/XML-AutoWriter-0.4/blib/lib/XML/ValidWriter.pm line 313.
^M                                                                             ^Mt/valid.....dubious
        Test returned status 2 (wstat 512, 0x200)
DIED. FAILED tests 2-16
        Failed 15/16 tests, 6.25% okay
Failed Test Stat Wstat Total Fail  Failed  List of Failed
-------------------------------------------------------------------------------
t/auto.t       2   512    18   34 188.89%  2-18
t/escape.t   255 65280    83  162 195.18%  3-83
t/foo.t      255 65280     1    2 200.00%  1
t/valid.t      2   512    16   30 187.50%  2-16
9 subtests skipped.
Failed 4/6 test scripts, 33.33% okay. 114/182 subtests failed, 37.36% okay.
make: *** [test_dynamic] Error 2
 * ERROR: dev-perl/XML-AutoWriter-0.40 failed:

Portage 2.2_rc51 (default/linux/amd64/10.0/server, gcc-4.4.2, glibc-2.11-r0, 2.6.32-rc6-git6 x86_64)
=================================================================
System uname: Linux-2.6.32-rc6-git6-x86_64-AMD_Phenom-tm-_9950_Quad-Core_Processor-with-gentoo-2.0.1
Timestamp of tree: Unknown
app-shells/bash:     4.0_p35
dev-lang/python:     2.6.4, 3.1.1-r1
sys-apps/baselayout: 2.0.1
sys-apps/openrc:     0.5.2-r2
sys-apps/sandbox:    2.2
sys-devel/autoconf:  2.63-r1
sys-devel/automake:  1.10.2, 1.11
sys-devel/binutils:  2.20
sys-devel/gcc-config: 1.4.1
sys-devel/libtool:   2.2.6b
virtual/os-headers:  2.6.30-r1
ACCEPT_KEYWORDS="amd64 ~amd64"
ACCEPT_LICENSE="*"
CBUILD="x86_64-pc-linux-gnu"
CFLAGS="-O2 -pipe"
CHOST="x86_64-pc-linux-gnu"
CONFIG_PROTECT="/etc /usr/kde/4.3/env /usr/kde/4.3/share/config /usr/kde/4.3/shutdown /usr/kde/4.4/env /usr/kde/4.4/share/config /usr/kde/4.4/shutdown
/usr/kde/live/env /usr/kde/live/share/config /usr/kde/live/shutdown /usr/share/X11/xkb /usr/share/config"                                                                   $
CONFIG_PROTECT_MASK="/etc/ca-certificates.conf /etc/env.d /etc/env.d/java/ /etc/eselect/postgresql /etc/fonts/fonts.conf /etc/gconf /etc/gentoo-release
/etc/php/apache2-php5/ext-active/ /etc/php/cgi-php5/ext-active/ /etc/php/cli-php5/ext-active/ /etc/revdep-rebuild /etc/sandbox.d /etc/terminfo
/etc/texmf/language.dat.d /etc/texmf/language.def.d /etc/texmf/updmap.d /etc/texmf/web2c /etc/udev/rules.d"                                                                 $
CXXFLAGS="-O2 -pipe"
DISTDIR="/usr/portage/distfiles"
FEATURES="assume-digests buildpkg distlocks fixpackages news parallel-fetch preserve-libs protect-owned sandbox sfperms strict test unmerge-logs unmerge-orphans
userfetch"
GENTOO_MIRRORS="http://distfiles.gentoo.org http://distro.ibiblio.org/pub/linux/distributions/gentoo"
LDFLAGS="-Wl,-O1"
MAKEOPTS="-j5"
PKGDIR="/usr/portage/packages"
PORTAGE_CONFIGROOT="/"
PORTAGE_RSYNC_OPTS="--recursive --links --safe-links --perms --times --compress --force --whole-file --delete --stats --timeout=180 --exclude=/distfiles
--exclude=/local --exclude=/packages"                                                                                                                                       $
PORTAGE_TMPDIR="/var/tmp"
PORTDIR="/usr/portage"
SYNC="rsync://localhost/gentoo-portage"
USE="X acl amd64 apache2 berkdb bzip2 cli cracklib crypt cups dri fortran gcj gdbm gpm iconv ipv6 ldap mmx modules mudflap multilib mysql ncurses nls nptl nptlonly
objc openmp pam pcre perl pppd python readline reflection session snmp spl sse sse2 ssl sysfs tcpd truetype unicode xml xorg zlib" ALSA_CARDS="ali5451 als4000 atiixp
atiixp-modem bt87x ca0106 cmipci emu10k1x ens1370 ens1371 es1938 es1968 fm801 hda-intel intel8x0 intel8x0m maestro3 trident usb-audio via82xx via82xx-modem ymfpci"
ALSA_PCM_PLUGINS="adpcm alaw asym copy dmix dshare dsnoop empty extplug file hooks iec958 ioplug ladspa lfloat linear meter mmap_emul mulaw multi null plug rate
route share shm softvol" APACHE2_MODULES="actions alias auth_basic authn_alias authn_anon authn_dbm authn_default authn_file authz_dbm authz_default authz_groupfile
authz_host authz_owner authz_user autoindex cache dav dav_fs dav_lock deflate dir disk_cache env expires ext_filter file_cache filter headers include info log_config
logio mem_cache mime mime_magic negotiation rewrite setenvif speling status unique_id userdir usertrack vhost_alias" ELIBC="glibc" INPUT_DEVICES="keyboard mouse
evdev" KERNEL="linux" LCD_DEVICES="bayrad cfontz cfontz633 glk hd44780 lb216 lcdm001 mtxorb ncurses text" USERLAND="GNU" VIDEO_CARDS="vga"
Unset:  CPPFLAGS, CTARGET, EMERGE_DEFAULT_OPTS, FFLAGS, INSTALL_MASK, LANG, LC_ALL, LINGUAS, PORTAGE_COMPRESS, PORTAGE_COMPRESS_FLAGS, PORTAGE_RSYNC_EXTRA_OPTS,
PORTDIR_OVERLAY
Comment 1 Diego Elio Pettenò (RETIRED) gentoo-dev 2009-12-22 22:20:55 UTC
Created attachment 213850 [details]
Build log

Since I have a build log with verbose tests it might be useful.
Comment 2 Mikle Kolyada archtester Gentoo Infrastructure gentoo-dev Security 2014-10-10 16:35:31 UTC
It works with last stable perl (i have no problem at least) so, i'm going to close this bug now, reopen if i was wrong.