Gentoo Websites Logo
Go to: Gentoo Home Documentation Forums Lists Bugs Planet Store Wiki Get Gentoo!
Bug 289448 - Stable request for dev-db/tora-2.1.0
Summary: Stable request for dev-db/tora-2.1.0
Alias: None
Product: Gentoo Linux
Classification: Unclassified
Component: [OLD] Development (show other bugs)
Hardware: All Linux
: High normal (vote)
Assignee: Tobias Scherbaum (RETIRED)
Depends on:
Blocks: 283429
  Show dependency tree
Reported: 2009-10-17 06:04 UTC by Tobias Scherbaum (RETIRED)
Modified: 2009-12-31 09:32 UTC (History)
0 users

See Also:
Package list:
Runtime testing required: ---


Note You need to log in before you can comment on or make changes to this bug.
Description Tobias Scherbaum (RETIRED) gentoo-dev 2009-10-17 06:04:11 UTC
please do so.
Comment 1 Tobias Klausmann gentoo-dev 2009-10-27 20:03:34 UTC
Stable on alpha.
Comment 2 Markus Meier gentoo-dev 2009-10-30 09:37:59 UTC
fails to build in src_test on amd64/x86:

i686-pc-linux-gnu-g++ -DHAVE_CONFIG_H -I. -I../..  -I../../ext/otl  -I/usr/include/qt4/ -I/usr/include/qt4//Qt -I/usr/include/qt4//QtCore -I/usr/include/
qt4//QtGui -I/usr/include/qt4//QtSql -I/usr/include/qt4//QtNetwork -I/usr/include/qt4//QtXml   -DDEFAULT_PLUGIN_DIR=\"/usr/lib\" -DTOVERSION=\"2.1.0\"  -
I../../src     -O2 -march=i686 -pipe -fno-inline -O2 -MT tomaintest.o -MD -MP -MF .deps/tomaintest.Tpo -c -o tomaintest.o tomaintest.cpp
mv -f .deps/tomaintest.Tpo .deps/tomaintest.Po
/bin/sh ../../libtool --tag=CXX   --mode=link i686-pc-linux-gnu-g++  -O2 -march=i686 -pipe -fno-inline -O2 -lpcre   -lQtCore -lQtGui -lQtGui -lQtSql -lQt
Network -lQtXml -L/usr/lib/qt4/         -lqscintilla -lcppunit -ldl   -lqscintilla2 -Wl,-O1 -DQT_NO_DEBUG -o ConfigurationTest toconfigurationtest.o toma
intest.o  -lpcre
libtool: link: i686-pc-linux-gnu-g++ -O2 -march=i686 -pipe -fno-inline -O2 -Wl,-O1 -DQT_NO_DEBUG -o ConfigurationTest toconfigurationtest.o tomaintest.o  -L/usr/lib/qt4 -L/usr/X11R6/lib /usr/lib/qt4/ /usr/lib/ /usr/lib/ /usr/lib/ -luuid /usr/lib/ /usr/lib/ /usr/lib/ /usr/lib/ /usr/lib/ /usr/lib/ /usr/lib/ /usr/lib/ /usr/lib/ /usr/lib/ /usr/lib/ /usr/lib/qt4/ /usr/lib/qt4/ /usr/lib/qt4/ /usr/lib/qt4/ -pthread -lz -lm /usr/lib/ -lrt /usr/lib/ -lpthread -L/usr/lib/qt4/ -lqscintilla /usr/lib/ -ldl -lqscintilla2 -lpcre
/usr/lib/gcc/i686-pc-linux-gnu/4.3.4/../../../../i686-pc-linux-gnu/bin/ld: cannot find -lqscintilla
collect2: ld returned 1 exit status
make[3]: *** [ConfigurationTest] Error 1
make[3]: Leaving directory `/var/tmp/portage/dev-db/tora-2.1.0/work/tora-2.1.0/test/configuration'
make[2]: *** [check-am] Error 2
make[2]: Leaving directory `/var/tmp/portage/dev-db/tora-2.1.0/work/tora-2.1.0/test/configuration'
make[1]: *** [check-recursive] Error 1
make[1]: Leaving directory `/var/tmp/portage/dev-db/tora-2.1.0/work/tora-2.1.0/test'
make: *** [check-recursive] Error 1
 * ERROR: dev-db/tora-2.1.0 failed.
 * Call stack:
 *     , line   49:  Called src_test
 *             environment, line 3137:  Called _eapi0_src_test
 *     , line  607:  Called die
 * The specific snippet of code:
 *                      hasq test $FEATURES && die "Make check failed. See above for details."
 *  The die message:
 *   Make check failed. See above for details.

dev-db/tora-2.1.0  USE="-debug -mysql -oci8-instant-client -oracle -postgres"

Portage (default/linux/x86/10.0/desktop, gcc-4.3.4, glibc-2.9_p20081201-r2, i686)
System uname: Linux-
Timestamp of tree: Thu, 29 Oct 2009 14:00:01 +0000
distcc 3.1 i686-pc-linux-gnu [disabled]
app-shells/bash:     4.0_p28
dev-java/java-config: 2.1.9-r1
dev-lang/python:     2.4.6, 2.5.4-r3, 2.6.2-r1
dev-python/pycrypto: 2.0.1-r8
dev-util/cmake:      2.6.4
sys-apps/sandbox:    1.6-r2
sys-devel/autoconf:  2.13, 2.63-r1
sys-devel/automake:  1.4_p6, 1.5, 1.7.9-r1, 1.8.5-r3, 1.9.6-r2, 1.10.2
sys-devel/binutils:  2.18-r3
sys-devel/gcc-config: 1.4.1
sys-devel/libtool:   2.2.6a
virtual/os-headers:  2.6.27-r2
CFLAGS="-O2 -march=i686 -pipe"
CONFIG_PROTECT="/etc /usr/kde/3.5/env /usr/kde/3.5/share/config /usr/kde/3.5/shutdown /usr/share/config /var/bind /var/lib/hsqldb"
CONFIG_PROTECT_MASK="/etc/ca-certificates.conf /etc/env.d /etc/env.d/java/ /etc/fonts/fonts.conf /etc/gconf /etc/php/apache2-php5/ext-active/ /etc/php/cgi-php5/ext-active/ /etc/php/cli-php5/ext-active/ /etc/revdep-rebuild /etc/sandbox.d /etc/terminfo /etc/texmf/language.dat.d /etc/texmf/language.def.d /etc/texmf/updmap.d /etc/texmf/web2c /etc/udev/rules.d"
CXXFLAGS="-O2 -march=i686 -pipe"
FEATURES="collision-protect distlocks fixpackages parallel-fetch protect-owned sandbox sfperms strict test unmerge-orphans userfetch userpriv usersandbox"
LINGUAS="en en_GB de"
PORTAGE_RSYNC_OPTS="--recursive --links --safe-links --perms --times --compress --force --whole-file --delete --stats --timeout=180 --exclude=/distfiles --exclude=/local --exclude=/packages"
USE="X a52 aac acl acpi alsa apache2 avahi berkdb bluetooth branding bzip2 cairo cdr cli consolekit cracklib crypt cups dbus dri dts dvd dvdr eds emboss encode evo examples fam firefox flac fortran gdbm gif gnome gpm gstreamer gtk hal iconv ipv6 isdnlog jpeg kde ldap libnotify mad mikmod modules mp3 mp4 mpeg mudflap ncurses nls nptl nptlonly objc objc++ ogg opengl openmp pam pcre pdf perl png ppds pppd python qt3support qt4 quicktime readline reflection sdl session source spell spl ssl startup-notification svg sysfs tcpd test thunar tiff truetype unicode usb vorbis win32codecs x264 x86 xml xorg xulrunner xv xvid zlib" ALSA_CARDS="ali5451 als4000 atiixp atiixp-modem bt87x ca0106 cmipci emu10k1 emu10k1x ens1370 ens1371 es1938 es1968 fm801 hda-intel intel8x0 intel8x0m maestro3 trident usb-audio via82xx via82xx-modem ymfpci" ALSA_PCM_PLUGINS="adpcm alaw asym copy dmix dshare dsnoop empty extplug file hooks iec958 ioplug ladspa lfloat linear meter mmap_emul mulaw multi null plug rate route share shm softvol" APACHE2_MODULES="actions alias auth_basic authn_alias authn_anon authn_dbm authn_default authn_file authz_dbm authz_default authz_groupfile authz_host authz_owner authz_user autoindex cache dav dav_fs dav_lock deflate dir disk_cache env expires ext_filter file_cache filter headers include info log_config logio mem_cache mime mime_magic negotiation rewrite setenvif speling status unique_id userdir usertrack vhost_alias" ELIBC="glibc" INPUT_DEVICES="keyboard mouse evdev" KERNEL="linux" LCD_DEVICES="bayrad cfontz cfontz633 glk hd44780 lb216 lcdm001 mtxorb ncurses text" LINGUAS="en en_GB de" USERLAND="GNU" VIDEO_CARDS="fbdev glint intel mach64 mga neomagic nv r128 radeon savage sis tdfx trident vesa vga via vmware voodoo"
Comment 3 Ben de Groot (RETIRED) gentoo-dev 2009-11-04 17:47:35 UTC
tora-1 depends on an ancient version of qscintilla and qt:3, which are scheduled for removal. Stabling tora-2 would help us. :-)
Comment 4 Jeroen Roovers (RETIRED) gentoo-dev 2009-11-11 15:31:25 UTC
(In reply to comment #2)
> fails to build in src_test on amd64/x86:

Yes, it can't find libqscintilla. Looks like the test suite needs an update to Qscintilla 2 too.

Stable for HPPA.
Comment 5 Markus Meier gentoo-dev 2009-11-20 13:16:38 UTC
amd64/x86 stable
Comment 6 Ben de Groot (RETIRED) gentoo-dev 2009-12-27 14:14:12 UTC
ppc: if you guys don't care about this, I'm just as happy to drop stable keyword for ppc here
Comment 7 Joe Jezak (RETIRED) gentoo-dev 2009-12-27 17:32:06 UTC
We'll get to it, we're pretty behind in keywording at the moment, please have a little patience.
Comment 8 Tobias Scherbaum (RETIRED) gentoo-dev 2009-12-31 09:32:11 UTC
Closing this one, as we're stabling 2.1.1 now in #298855.