Gentoo Websites Logo
Go to: Gentoo Home Documentation Forums Lists Bugs Planet Store Wiki Get Gentoo!
Bug 255053 - sys-boot/mbr-{1.1.10,1.1.11} fails tests
Summary: sys-boot/mbr-{1.1.10,1.1.11} fails tests
Status: CONFIRMED
Alias: None
Product: Gentoo Linux
Classification: Unclassified
Component: Current packages (show other bugs)
Hardware: All Linux
: High normal (vote)
Assignee: No maintainer - Look at https://wiki.gentoo.org/wiki/Project:Proxy_Maintainers if you want to take care of it
URL:
Whiteboard:
Keywords: TESTFAILURE
Depends on:
Blocks:
 
Reported: 2009-01-15 16:04 UTC by Mart Raudsepp
Modified: 2019-05-18 10:22 UTC (History)
1 user (show)

See Also:
Package list:
Runtime testing required: ---


Attachments
build.log (build.log,11.94 KB, text/plain)
2018-08-28 23:37 UTC, Thomas Deutschmann
Details

Note You need to log in before you can comment on or make changes to this bug.
Description Mart Raudsepp gentoo-dev 2009-01-15 16:04:35 UTC
Because tests for some reason need the "co" program from rcs package and do something weird about it. Should be investigated what it does and perhaps even just disable some of the tests instead if that historic,v handling is bogus.
Comment 1 Jonathan Lovelace 2009-10-20 18:23:55 UTC
With app-text/rcs installed, the test using co fails; 6 of the 8 other tests fail for me, however, each with the error message "install-mbr:test-mbr: No boot signature found.  Use --force to override." Version 1.1.11 (not yet in portage, but renaming the ebuild works without modification) passes all its tests on my machine.
Comment 2 Víctor Ostorga (RETIRED) gentoo-dev 2009-10-20 20:45:38 UTC
Version bump to 1.1.11 and fix DEPEND on app-text/rcs when doing tests.
Sadly, tests failed on my machine
Comment 3 Pacho Ramos gentoo-dev 2012-06-05 07:51:01 UTC
(In reply to comment #2)
> Version bump to 1.1.11 and fix DEPEND on app-text/rcs when doing tests.
> Sadly, tests failed on my machine

Provide build.log for this please
Comment 4 Michael Palimaka (kensington) gentoo-dev 2012-10-18 13:51:35 UTC
All tests pass for me.

Please reopen if you still encounter failure, attaching emerge --info and the build log.
Comment 5 Thomas Deutschmann gentoo-dev Security 2018-08-28 23:37:27 UTC
Created attachment 545414 [details]
build.log

Test failure on x86:

> >>> Test phase: sys-boot/mbr-1.1.11-r1
> make --jobs 5 --load-average 7.95   check
> Making check in harness
> make[1]: Entering directory '/var/tmp/portage/sys-boot/mbr-1.1.11-r1/work/mbr-1.1.11/harness'
> make[1]: Nothing to be done for 'check'.
> make[1]: Leaving directory '/var/tmp/portage/sys-boot/mbr-1.1.11-r1/work/mbr-1.1.11/harness'
> make[1]: Entering directory '/var/tmp/portage/sys-boot/mbr-1.1.11-r1/work/mbr-1.1.11'
> make  table.b mbr.b mbr-1.1.3.b mbr-1.1.2.b mbr-1.1.1.b mbr-1.1.0.b mbr-1.0.1.b mbr-1.0.0.b
> make[2]: Entering directory '/var/tmp/portage/sys-boot/mbr-1.1.11-r1/work/mbr-1.1.11'
> i686-pc-linux-gnu-gcc -E -xc table.S86 -o table.s86.tmp && mv table.s86.tmp table.s86
> make[2]: 'mbr.b' is up to date.
> co -pMBR_1_1_3 historic,v >mbr-1.1.3.S86
> co -pMBR_1_1_2 historic,v >mbr-1.1.2.S86
> historic,v  -->  standard output
> revision 1.5
> co -pMBR_1_1_0 historic,v >mbr-1.1.0.S86
> co -pMBR_1_1_1 historic,v >mbr-1.1.1.S86
> historic,v  -->  standard output
> revision 1.6
> co -pMBR_1_0_0 historic,v >mbr-1.0.0.S86
> historic,v  -->  standard output
> revision 1.4
> as86 -0 -b table.b.tmp -s table.sym -l table.lst table.s86 && mv table.b.tmp table.b
> historic,v  -->  standard output
> revision 1.3
> i686-pc-linux-gnu-gcc -E -xc mbr-1.1.3.S86 -o mbr-1.1.3.s86.tmp && mv mbr-1.1.3.s86.tmp mbr-1.1.3.s86
> co -pMBR_1_0_1 historic,v >mbr-1.0.1.S86
> historic,v  -->  standard output
> revision 1.1
> i686-pc-linux-gnu-gcc -E -xc mbr-1.1.1.S86 -o mbr-1.1.1.s86.tmp && mv mbr-1.1.1.s86.tmp mbr-1.1.1.s86
> i686-pc-linux-gnu-gcc -E -xc mbr-1.1.0.S86 -o mbr-1.1.0.s86.tmp && mv mbr-1.1.0.s86.tmp mbr-1.1.0.s86
> historic,v  -->  standard output
> revision 1.2
> i686-pc-linux-gnu-gcc -E -xc mbr-1.0.0.S86 -o mbr-1.0.0.s86.tmp && mv mbr-1.0.0.s86.tmp mbr-1.0.0.s86
> as86 -0 -b mbr-1.1.3.b.tmp -s mbr-1.1.3.sym -l mbr-1.1.3.lst mbr-1.1.3.s86 && mv mbr-1.1.3.b.tmp mbr-1.1.3.b
> i686-pc-linux-gnu-gcc -E -xc mbr-1.0.1.S86 -o mbr-1.0.1.s86.tmp && mv mbr-1.0.1.s86.tmp mbr-1.0.1.s86
> as86 -0 -b mbr-1.1.1.b.tmp -s mbr-1.1.1.sym -l mbr-1.1.1.lst mbr-1.1.1.s86 && mv mbr-1.1.1.b.tmp mbr-1.1.1.b
> i686-pc-linux-gnu-gcc -E -xc mbr-1.1.2.S86 -o mbr-1.1.2.s86.tmp && mv mbr-1.1.2.s86.tmp mbr-1.1.2.s86
> as86 -0 -b mbr-1.0.0.b.tmp -s mbr-1.0.0.sym -l mbr-1.0.0.lst mbr-1.0.0.s86 && mv mbr-1.0.0.b.tmp mbr-1.0.0.b
> as86 -0 -b mbr-1.1.0.b.tmp -s mbr-1.1.0.sym -l mbr-1.1.0.lst mbr-1.1.0.s86 && mv mbr-1.1.0.b.tmp mbr-1.1.0.b
> as86 -0 -b mbr-1.0.1.b.tmp -s mbr-1.0.1.sym -l mbr-1.0.1.lst mbr-1.0.1.s86 && mv mbr-1.0.1.b.tmp mbr-1.0.1.b
> as86 -0 -b mbr-1.1.2.b.tmp -s mbr-1.1.2.sym -l mbr-1.1.2.lst mbr-1.1.2.s86 && mv mbr-1.1.2.b.tmp mbr-1.1.2.b
> rm mbr-1.0.1.s86 mbr-1.1.3.s86 mbr-1.0.0.s86 table.s86 mbr-1.1.0.s86 mbr-1.1.1.s86 mbr-1.1.2.s86
> make[2]: Leaving directory '/var/tmp/portage/sys-boot/mbr-1.1.11-r1/work/mbr-1.1.11'
> make  check-TESTS
> make[2]: Entering directory '/var/tmp/portage/sys-boot/mbr-1.1.11-r1/work/mbr-1.1.11'
> PASS: tests/version
> PASS: tests/inst-1
> PASS: tests/inst-2
> PASS: tests/inst-3
> PASS: tests/inst-4
> PASS: tests/inst-5
> PASS: tests/inst-6
> PASS: tests/inst-7
> PASS: tests/inst-8
> Failed to map area at 0x0: Operation not permitted
> FAIL: tests/mbr-1
> Failed to map area at 0x0: Operation not permitted
> FAIL: tests/mbr-2
> Failed to map area at 0x0: Operation not permitted
> FAIL: tests/mbr-3
> Failed to map area at 0x0: Operation not permitted
> FAIL: tests/mbr-4
> Failed to map area at 0x0: Operation not permitted
> FAIL: tests/mbr-5
> Failed to map area at 0x0: Operation not permitted
> FAIL: tests/mbr-6
> Failed to map area at 0x0: Operation not permitted
> FAIL: tests/testdisk-1
> Failed to map area at 0x0: Operation not permitted
> FAIL: tests/testdisk-2
> Failed to map area at 0x0: Operation not permitted
> FAIL: tests/testdisk-3
> Failed to map area at 0x0: Operation not permitted
> FAIL: tests/testdisk-4
> Failed to map area at 0x0: Operation not permitted
> FAIL: tests/testdisk-5
> Failed to map area at 0x0: Operation not permitted
> FAIL: tests/testdisk-6
> =====================
> 12 of 21 tests failed
> =====================
> make[2]: *** [Makefile:475: check-TESTS] Error 1
> make[2]: Leaving directory '/var/tmp/portage/sys-boot/mbr-1.1.11-r1/work/mbr-1.1.11'
> make[1]: *** [Makefile:691: check-am] Error 2
> make[1]: Leaving directory '/var/tmp/portage/sys-boot/mbr-1.1.11-r1/work/mbr-1.1.11'
> make: *** [Makefile:349: check-recursive] Error 1
>  * ERROR: sys-boot/mbr-1.1.11-r1::gentoo failed (test phase):
>  *   Make check failed. See above for details.




Portage 2.3.40 (python 3.6.5-final-0, default/linux/x86/17.0, gcc-7.3.0, glibc-2.26-r7, 4.14.65-gentoo i686)
=================================================================
System uname: Linux-4.14.65-gentoo-i686-Intel-R-_Core-TM-_i7-3770K_CPU_@_3.50GHz-with-gentoo-2.4.1
KiB Mem:     3107592 total,    767484 free
KiB Swap:     488276 total,    483404 free
Timestamp of repository gentoo: Tue, 28 Aug 2018 21:04:30 +0000
Head commit of repository gentoo: 6433c22d0d3798d7a8ede21ba41c90bdcd166844

sh bash 4.4_p12
ld GNU ld (Gentoo 2.30 p2) 2.30.0
app-shells/bash:          4.4_p12::gentoo
dev-java/java-config:     2.2.0-r4::gentoo
dev-lang/perl:            5.24.3-r1::gentoo
dev-lang/python:          2.7.14-r1::gentoo, 3.6.5::gentoo
dev-util/cmake:           3.9.6::gentoo
dev-util/pkgconfig:       0.29.2::gentoo
sys-apps/baselayout:      2.4.1-r2::gentoo
sys-apps/openrc:          0.34.11::gentoo
sys-apps/sandbox:         2.13::gentoo
sys-devel/autoconf:       2.13::gentoo, 2.69-r4::gentoo
sys-devel/automake:       1.15.1-r2::gentoo
sys-devel/binutils:       2.30-r2::gentoo
sys-devel/gcc:            7.3.0-r3::gentoo
sys-devel/gcc-config:     1.8-r1::gentoo
sys-devel/libtool:        2.4.6-r3::gentoo
sys-devel/make:           4.2.1-r3::gentoo
sys-kernel/linux-headers: 4.13::gentoo (virtual/os-headers)
sys-libs/glibc:           2.26-r7::gentoo
Repositories:

gentoo
    location: /usr/portage
    sync-type: git
    sync-uri: https://github.com/gentoo-mirror/gentoo.git
    priority: -1000

ABI="x86"
ABI_X86="32"
ACCEPT_KEYWORDS="x86"
ACCEPT_LICENSE="* -@EULA"
ACCEPT_PROPERTIES="*"
ACCEPT_RESTRICT="*"
ANT_HOME="/usr/share/ant"
ARCH="x86"
BROOT=""
CBUILD="i686-pc-linux-gnu"
CFLAGS="-O2 -pipe -march=pentium4m -mtune=pentium4m"
CHOST="i686-pc-linux-gnu"
CHOST_x86="i686-pc-linux-gnu"
COLLISION_IGNORE="/lib/modules/*"
CONFIG_PROTECT="/etc /usr/lib/libreoffice/program/sofficerc /usr/share/config /usr/share/gnupg/qualified.txt"
CPU_FLAGS_X86="mmx mmxext sse sse2"
CXXFLAGS="-O2 -pipe -march=pentium4m -mtune=pentium4m"
DEFAULT_ABI="x86"
EDITOR="/usr/bin/mcedit"
ELIBC="glibc"
ENV_UNSET="DBUS_SESSION_BUS_ADDRESS DISPLAY PERL5LIB PERL5OPT PERLPREFIX PERL_CORE PERL_MB_OPT PERL_MM_OPT XAUTHORITY XDG_CACHE_HOME XDG_CONFIG_HOME XDG_DATA_HOME XDG_RUNTIME_DIR"
EPREFIX=""
EROOT="/"
ESYSROOT="/"
FCFLAGS="-O2 -march=i686 -pipe"
FEATURES="assume-digests binpkg-logs cgroup config-protect-if-modified distlocks downgrade-backup ebuild-locks fixlafiles merge-sync multilib-strict news parallel-fetch preserve-libs protect-owned sandbox sfperms strict unknown-features-warn unmerge-logs unmerge-orphans userfetch userpriv usersandbox usersync xattr"
FFLAGS="-O2 -march=i686 -pipe"
GCC_SPECS=""
GRUB_PLATFORMS="efi-32 pc"
GSETTINGS_BACKEND="dconf"
HOME="/root"
INFOPATH="/usr/share/gcc-data/i686-pc-linux-gnu/7.3.0/info:/usr/share/binutils-data/i686-pc-linux-gnu/2.30/info:/usr/share/info"
INPUT_DEVICES="libinput keyboard mouse"
IUSE_IMPLICIT="abi_x86_32 prefix prefix-chain prefix-guest"
JAVAC="/etc/java-config-2/current-system-vm/bin/javac"
JAVA_HOME="/etc/java-config-2/current-system-vm"
JDK_HOME="/etc/java-config-2/current-system-vm"
KERNEL="linux"
L10N="en en-US de de-DE"
LADSPA_PATH="/usr/lib/ladspa"
LANG="en_US.UTF-8"
LC_ALL="en_US.UTF-8"
LC_MESSAGES="C"
LC_PAPER="de_DE.UTF-8"
LDFLAGS="-Wl,-O1 -Wl,--as-needed"
LIBDIR_x86="lib"
LINGUAS="en de"
LOGNAME="root"
MAIL="/var/mail/root"
MAKEOPTS="--jobs 5 --load-average 7.95"
MULTILIB_ABIS="x86"
NOCOLOR="true"
OFFICE_IMPLEMENTATION="libreoffice"
OLDPWD="/root"
OPENCL_PROFILE="mesa"
OPENGL_PROFILE="xorg-x11"
PAGER="/usr/bin/less"
PATH="/usr/i686-pc-linux-gnu/gcc-bin/7.3.0:/usr/lib/llvm/6/bin:/usr/lib/llvm/5/bin:/usr/local/sbin:/usr/local/bin:/usr/sbin:/usr/bin:/sbin:/bin:/opt/bin"
PHP_TARGETS="php5-6 php7-0"
POSTGRES_TARGETS="postgres9_5 postgres10"
PWD="/tmp"
PYTHONDONTWRITEBYTECODE="1"
PYTHON_SINGLE_TARGET="python3_6"
PYTHON_TARGETS="python2_7 python3_6"
QT_GRAPHICSSYSTEM="raster"
ROOT="/"
ROOTPATH="/usr/i686-pc-linux-gnu/gcc-bin/7.3.0:/usr/lib/llvm/6/bin:/usr/lib/llvm/5/bin:/usr/local/sbin:/usr/local/bin:/usr/sbin:/usr/bin:/sbin:/bin:/opt/bin"
RUBY_TARGETS="ruby22 ruby23"
SHELL="/bin/bash"
SHLVL="2"
SSH_TTY="/dev/pts/0"
SYSROOT="/"
TERM="tmux-256color"
TMUX="/tmp/tmux-0/default,5485,0"
TMUX_PANE="%2"
TWISTED_DISABLE_WRITING_OF_PLUGIN_CACHE="1"
USER="root"
USERLAND="GNU"
VIDEO_CARDS="vmware"
XDG_CONFIG_DIRS="/etc/xdg"
XDG_DATA_DIRS="/usr/local/share:/usr/share"