Gentoo Websites Logo
Go to: Gentoo Home Documentation Forums Lists Bugs Planet Store Wiki Get Gentoo!
Bug 237725 - net-fs/nfs-utils-1.1.0-r1 fails: /bin/sh: DHAVE_CONFIG_H: command not found
Summary: net-fs/nfs-utils-1.1.0-r1 fails: /bin/sh: DHAVE_CONFIG_H: command not found
Alias: None
Product: Gentoo Linux
Classification: Unclassified
Component: Current packages (show other bugs)
Hardware: All Linux
: High normal (vote)
Assignee: Network Filesystems
Depends on:
Reported: 2008-09-15 14:06 UTC by Albert Zeyer
Modified: 2008-10-26 10:58 UTC (History)
1 user (show)

See Also:
Package list:
Runtime testing required: ---


Note You need to log in before you can comment on or make changes to this bug.
Description Albert Zeyer 2008-09-15 14:06:14 UTC
Ah new one. :) (And probably again *not* related to case sensitivity.)

checking for strtoul... yes
checking for sigprocmask... yes
checking for short... yes
checking size of short... 2
checking for int... yes
checking size of int... 4
checking for long... yes
checking size of long... 4
checking for size_t... (cached) yes
checking size of size_t... 4
checking for socklen_t... yes
checking size of socklen_t... 4
configure: creating ./config.status
config.status: creating Makefile
config.status: creating linux-nfs/Makefile
config.status: creating support/Makefile
config.status: creating support/export/Makefile
config.status: creating support/include/nfs/Makefile
config.status: creating support/include/rpcsvc/Makefile
config.status: creating support/include/sys/fs/Makefile
config.status: creating support/include/sys/Makefile
config.status: creating support/include/Makefile
config.status: creating support/misc/Makefile
config.status: creating support/nfs/Makefile
config.status: creating tools/Makefile
config.status: creating tools/locktest/Makefile
config.status: creating tools/nlmtest/Makefile
config.status: creating tools/rpcdebug/Makefile
config.status: creating tools/rpcgen/Makefile
config.status: creating utils/Makefile
config.status: creating utils/exportfs/Makefile
config.status: creating utils/gssd/Makefile
config.status: creating utils/idmapd/Makefile
config.status: creating utils/mount/Makefile
config.status: creating utils/mountd/Makefile
config.status: creating utils/nfsd/Makefile
config.status: creating utils/nfsstat/Makefile
config.status: creating utils/showmount/Makefile
config.status: creating utils/statd/Makefile
config.status: creating support/include/config.h
config.status: executing depfiles commands
Making all in tools
make[1]: Entering directory `/var/tmp/portage/net-fs/nfs-utils-1.1.0-r1/work/nfs-utils-1.1.0/tools'
Making all in locktest
make[2]: Entering directory `/var/tmp/portage/net-fs/nfs-utils-1.1.0-r1/work/nfs-utils-1.1.0/tools/locktest'
DHAVE_CONFIG_H -I. -I../../support/include  -D_GNU_SOURCE -D_GNU_SOURCE -O2 -march=nocona -pipe -ggdb -O2 -march=nocona -pipe -ggdb -MT testlk-testlk.o -MD -MP -MF .deps/testlk-testlk.Tpo -c -o testlk-testlk.o `test -f 'testlk.c' || echo './'`testlk.c
/bin/sh: DHAVE_CONFIG_H: command not found
make[2]: [testlk-testlk.o] Error 127 (ignored)
mv -f .deps/testlk-testlk.Tpo .deps/testlk-testlk.Po
mv: cannot stat `.deps/testlk-testlk.Tpo': No such file or directory
make[2]: *** [testlk-testlk.o] Error 1
make[2]: Leaving directory `/var/tmp/portage/net-fs/nfs-utils-1.1.0-r1/work/nfs-utils-1.1.0/tools/locktest'
make[1]: *** [all-recursive] Error 1
make[1]: Leaving directory `/var/tmp/portage/net-fs/nfs-utils-1.1.0-r1/work/nfs-utils-1.1.0/tools'
make: *** [all-recursive] Error 1
 * ERROR: net-fs/nfs-utils-1.1.0-r1 failed.
 * Call stack:
 *     , line   49:  Called src_compile
 *             environment, line 2370:  Called die
 * The specific snippet of code:
 *       emake || die "Failed to compile"
 *  The die message:
 *   Failed to compile
 * If you need support, post the topmost build error, and the call stack if relevant.
 * A complete build log is located at '/var/tmp/portage/net-fs/nfs-utils-1.1.0-r1/temp/build.log'.
 * The ebuild environment file is located at '/var/tmp/portage/net-fs/nfs-utils-1.1.0-r1/temp/environment'.
Comment 1 Albert Zeyer 2008-09-15 14:09:57 UTC
macbook ~ # emerge --info
Portage (default/linux/x86/2008.0/desktop, gcc-4.1.2, glibc-2.6.1-r0, 2.6.18-6-686 i686)
System uname: 2.6.18-6-686 i686 Intel(R) Core(TM)2 CPU T7400 @ 2.16GHz
Timestamp of tree: Sun, 14 Sep 2008 17:00:02 +0000
app-shells/bash:     3.2_p33
dev-java/java-config: 1.3.7, 2.1.6
dev-lang/python:     2.4.4-r13, 2.5.2-r7
dev-python/pycrypto: 2.0.1-r6
sys-devel/autoconf:  2.61-r2
sys-devel/automake:  1.7.9-r1, 1.8.5-r3, 1.9.6-r2, 1.10.1
sys-devel/binutils:  2.18-r3
sys-devel/gcc-config: 1.4.0-r4
sys-devel/libtool:   1.5.26
virtual/os-headers:  2.6.23-r3
CFLAGS="-O2 -march=nocona -pipe -ggdb"
CONFIG_PROTECT="/etc /usr/kde/3.5/env /usr/kde/3.5/share/config /usr/kde/3.5/shutdown /usr/share/config"
CONFIG_PROTECT_MASK="/etc/ca-certificates.conf /etc/env.d /etc/env.d/java/ /etc/fonts/fonts.conf /etc/gconf /etc/php/apache2-php5/ext-active/ /etc/php/cgi-php5/ext-active/ /etc/php/cli-php5/ext-active/ /etc/revdep-rebuild /etc/terminfo /etc/texmf/web2c /etc/udev/rules.d"
CXXFLAGS="-O2 -march=nocona -pipe -ggdb"
FEATURES="distlocks metadata-transfer parallel-fetch sandbox sfperms splitdebug unmerge-orphans userfetch"
PORTAGE_RSYNC_OPTS="--recursive --links --safe-links --perms --times --compress --force --whole-file --delete --stats --timeout=180 --exclude=/distfiles --exclude=/local --exclude=/packages"
USE="7zip X a52 aac acl acpi alsa altenburgcards amarok amr amuled apm applet async asyncns atm automount avahi bash-completion berkdb bluetooth bonjour bookmarks branding bzip2 c++ cairo cdr cisco cli cracklib crypt cups cxx d daap dbus dedicated deskbar dga dhcp divx dri dv dvd dvdr dvdread dvi eap-tls eds emboss enblend encode esd evo exif extra-algorithms fam fasttrack ffmpeg firefox flac ftp galago gd gdbm german gif glib glitz gmedia gnome gnutella gnutls gphoto2 gpm gsf gstreamer gtk h323 hal haskell hddtemp hfs howl-compat iconv icu id3 id3tag ieee1394 imlib injection inkjar ipv6 irda isdnlog isight jabber java javascript jit joystick jpeg jpeg2k kde kerberos kig-scripting kqemu latex lcms ldap libnotify lirc lm_sensors lua lzo macbook mad madwifi maps mdnsresponder-compat midi mikmod mmap mmx mng mozdevelop mp2 mp3 mp4 mpeg mplayer mtp mudflap music musicbrainz nautilus ncurses net network networking njb nls nntp nptl nptlonly nsplugin ntfs ogg opengl openmp oss pam pascal pch pcre pdf perl pidgin plotutils pmu png pnm posix postgres postscript ppds pptp ps pth pulseaudio python qt3 qt3support qt4 quicktime rar rc5 rdesktop readline real realmedia reflection reiser4 reiserfs rtc samba screen sdl sdl-image sdl-sound sdlaudio server session sftp sharedmem sift slp smp sockets socks5 solver sourceview speex spell spl spoof-source sse sse2 ssl ssse3 startup-notification subversion svg sysfs tetex theora threads threadsafe tiff timidity tk trayicon truetype unicode unzip usb v4l2 valgrind vcd video voice vorbis weak-algorithms wifi win32codecs wma wmp wxwindows x264 x86 xanim xattr xcomposite xext xface xine xml xmlreader xorg xrandr xscreensaver xulrunner xv xvid zeroconf zip zlib zsh-completion" ALSA_CARDS="hda-intel" ALSA_PCM_PLUGINS="adpcm alaw asym copy dmix dshare dsnoop empty extplug file hooks iec958 ioplug ladspa lfloat linear meter mmap_emul mulaw multi null plug rate route share shm softvol" APACHE2_MODULES="actions alias auth_basic authn_alias authn_anon authn_dbm authn_default authn_file authz_dbm authz_default authz_groupfile authz_host authz_owner authz_user autoindex cache dav dav_fs dav_lock deflate dir disk_cache env expires ext_filter file_cache filter headers include info log_config logio mem_cache mime mime_magic negotiation rewrite setenvif speling status unique_id userdir usertrack vhost_alias" CAMERAS="sony_dscf1 sony_dscf55" ELIBC="glibc" INPUT_DEVICES="keyboard mouse evdev wacom" KERNEL="linux" LCD_DEVICES="bayrad cfontz cfontz633 glk hd44780 lb216 lcdm001 mtxorb ncurses text" LINGUAS="de" LIRC_DEVICES="inputlirc macmini" USERLAND="GNU" VIDEO_CARDS="i810 vesa"

Comment 2 Albert Zeyer 2008-09-15 14:13:13 UTC
This is again the common issue with CC_FOR_BUILD. See bug #229415 as an example.

You can fix (workaround) it by specifying CC_FOR_BUILD. I modified the src_compile() in the ebuild like this:

src_compile() {
    econf \
        --mandir=/usr/share/man \
        --with-statedir=/var/lib/nfs \
        --disable-rquotad \
        --enable-nfsv3 \
        --enable-secure-statd \
        $(use_with tcpd tcp-wrappers) \
        $(use_enable !nonfsv4 nfsv4) \
        $(use_enable kerberos gss) \
        CC_FOR_BUILD=$(tc-getBUILD_CC) \
        || die "Configure failed"
    emake || die "Failed to compile"

That fixes the problem, it emerges fine now.
Comment 3 Albert Zeyer 2008-09-15 21:59:08 UTC
This is not related to case sensitifity.

Please read my report.

That is a common bug. Please look also at my references.
Comment 4 Albert Zeyer 2008-09-15 22:19:04 UTC
Please see bug #229415 as a proof that this has nothing to do with case sensitivity.
Comment 5 SpanKY gentoo-dev 2008-10-26 08:28:36 UTC
CC_FOR_BUILD doesnt randomly get set to "".  your env had to coerce it that way.
Comment 6 Albert Zeyer 2008-10-26 10:34:53 UTC
(In reply to comment #5)
> CC_FOR_BUILD doesnt randomly get set to "".  your env had to coerce it that
> way.

Yes I know, but a lot of people run into this problem. A lot of ebuilds already have this workaround (just make a fast grep for ebuilds which sets CC_FOR_BUILD) and you will also find a lot of bug reports, for example:

bug #215831
bug #231050
bug #237725
bug #229415
bug #219042
bug #237736
bug #158775

One of the reasons why a user could have this problem is stated here:
bug #139559
Comment 7 SpanKY gentoo-dev 2008-10-26 10:58:19 UTC
ebuilds should not be working around a broken user setup.  fix your setup.