Gentoo Websites Logo
Go to: Gentoo Home Documentation Forums Lists Bugs Planet Store Wiki Get Gentoo!
Bug 234991 - app-dicts/verbiste-0.1.21 fails to rebuild
Summary: app-dicts/verbiste-0.1.21 fails to rebuild
Alias: None
Product: Gentoo Linux
Classification: Unclassified
Component: Current packages (show other bugs)
Hardware: All Linux
: High normal (vote)
Assignee: Olivier Crete (RETIRED)
Depends on:
Blocks: gcc-4.3
  Show dependency tree
Reported: 2008-08-17 08:22 UTC by Graham Murray
Modified: 2008-08-17 18:13 UTC (History)
0 users

See Also:
Package list:
Runtime testing required: ---


Note You need to log in before you can comment on or make changes to this bug.
Description Graham Murray 2008-08-17 08:22:39 UTC
When running 'emerge @preserved-rebuild' following the upgrade to dev-libs/DirectFB-1.2.2, rebuilding app-dicts/verbiste-0.1.21 fails with

/usr/lib/gcc/i686-pc-linux-gnu/4.3.1/include/g++-v4/backward/backward_warning.h:32:2: warning: #warning This file includes at least one deprecated or antiquated header which may be removed without further notice at a future date. Please use a non-deprecated interface with equivalent functionality instead. For a listing of replacement headers and interfaces, consult the file backward_warning.h. To disable this warning use -Wno-deprecated.
FrenchVerbDictionary.cpp: In member function 'size_t AutoString::length() const':
FrenchVerbDictionary.cpp:51: error: 'strlen' was not declared in this scope
FrenchVerbDictionary.cpp: In static member function 'static Mode verbiste::FrenchVerbDictionary::convertModeName(const char*)':
FrenchVerbDictionary.cpp:496: error: 'strcmp' was not declared in this scope
FrenchVerbDictionary.cpp: In static member function 'static Tense verbiste::FrenchVerbDictionary::convertTenseName(const char*)':
FrenchVerbDictionary.cpp:519: error: 'strcmp' was not declared in this scope
FrenchVerbDictionary.cpp: In member function 'std::string verbiste::FrenchVerbDictionary::latin1ToUTF8(const std::string&) const':
FrenchVerbDictionary.cpp:655: error: 'strcpy' was not declared in this scope
FrenchVerbDictionary.cpp: In member function 'std::string verbiste::FrenchVerbDictionary::utf8ToLatin1(const std::string&) const':
FrenchVerbDictionary.cpp:685: error: 'strcpy' was not declared in this scope
FrenchVerbDictionary.cpp: In static member function 'static void verbiste::FrenchVerbDictionary::generateTense(const std::string&, const TemplateSpec&, Mode, Tense, std::vector<std::vector<std::basic_string<char, std::char_traits<char>, std::allocator<char> >, std::allocator<std::basic_string<char, std::char_traits<char>, std::allocator<char> > > >, std::allocator<std::vector<std::basic_string<char, std::char_traits<char>, std::allocator<char> >, std::allocator<std::basic_string<char, std::char_traits<char>, std::allocator<char> > > > > >&, bool, bool)':
FrenchVerbDictionary.cpp:785: error: 'strchr' was not declared in this scope
make[2]: *** [libverbiste_0_1_la-FrenchVerbDictionary.lo] Error 1

emerge --info
Portage 2.2_rc8 (default/linux/x86/2008.0/desktop, gcc-4.3.1, glibc-2.8_p20080602-r0, 2.6.26-gentoo-r1-ext4-6 i686)
System uname: Linux-2.6.26-gentoo-r1-ext4-6-i686-Intel-R-_Core-TM-2_CPU_6700_@_2.66GHz-with-glibc2.0
Timestamp of tree: Sat, 16 Aug 2008 21:15:01 +0000
app-shells/bash:     3.2_p39
dev-java/java-config: 1.3.7, 2.1.6-r1
dev-lang/python:     2.4.4-r11, 2.5.2-r7
dev-python/pycrypto: 2.0.1-r6
sys-apps/baselayout: 2.0.0
sys-apps/openrc:     0.2.5
sys-devel/autoconf:  2.13, 2.62-r1
sys-devel/automake:  1.5, 1.7.9-r1, 1.8.5-r3, 1.9.6-r2, 1.10.1-r1
sys-devel/binutils:  2.18-r3
sys-devel/gcc-config: 1.4.0-r4
sys-devel/libtool:   2.2.4
virtual/os-headers:  2.6.25-r4
CFLAGS="-O2 -march=native -mtune=native -pipe -ggdb"
CONFIG_PROTECT="/etc /usr/kde/3.5/env /usr/kde/3.5/share/config /usr/kde/3.5/shutdown /usr/share/config /var/bind /var/lib/hsqldb"
CONFIG_PROTECT_MASK="/etc/ca-certificates.conf /etc/env.d /etc/env.d/java/ /etc/eselect/postgresql /etc/fonts/fonts.conf /etc/gconf /etc/gentoo-release /etc/revdep-rebuild /etc/terminfo /etc/texmf/web2c /etc/udev/rules.d"
CXXFLAGS="-O2 -march=native -mtune=native -pipe -ggdb"
EMERGE_DEFAULT_OPTS="--with-bdeps y"
FEATURES="buildsyspkg distlocks installsources parallel-fetch preserve-libs sandbox sfperms splitdebug strict unmerge-orphans userfetch"
LINGUAS="en_GB en"
PORTAGE_RSYNC_OPTS="--recursive --links --safe-links --perms --times --compress --force --whole-file --delete --stats --timeout=180 --exclude=/distfiles --exclude=/local --exclude=/packages"
PORTDIR_OVERLAY="/usr/portage/local/layman/sunrise /usr/local/portage"
USE="X a52 aac aalib acl acpi aim alsa apache2 arts audiofile avi bash-completion berkdb bluetooth bonobo branding browserplugin bzip2 bzlib cairo caps cddb cdparanoia cdr cjk cli cracklib crypt cups curl cvs cxx dbus directfb doc dri dts dvd dvdr dvdread eds emacs emboss encode esd ethereal evo examples exif expat fam fbcon ffmpeg fftw flac fontconfig foomaticdb fortran ftp gcj gd gdbm gif glut gmp gnome gnome-keyring gnutls gphoto2 gpm graphviz gstreamer gtk gtk2 gtkhtml guile hal iconv icq idn ieee1394 imagemagick imlib ipv6 isdnlog jabber jack java javascript jbig jce jpeg jpeg2k junit kde kdehiddenvisibility kerberos ladspa latex lcms ldap leim libgda libnotify libsamplerate libwww lirc lm_sensors logrotate lua m17n-lib mad matroska mbox midi mikmod milter mime mmap mmx mng modplug mono mozilla mp3 mpeg mpi mplayer msn mudflap musepack ncurses nls nptl nptlonly nsplugin odbc offensive ogg oggvorbis openal opengl openmp oscar oss pam pcntl pcre pdf perl png postgres ppds pppd profile pulseaudio python qt3 qt3support qt4 quicktime readline recode reflection ruby sasl sdl session sharedmem sndfile snmp sockets sox speex spell spl sqlite sqlite3 sse sse2 ssl startup-notification subversion svg sysfs sysvipc tcl tcltk tcpd theora threads tiff tk truetype uicktime unicode usb v4l v4l2 vim-syntax vorbis wavpack win32codecs wmf wxwindows x264 x86 xattr xcb xface xine xml xml2 xorg xulrunner xv xvid yahoo zlib" ALSA_CARDS="hda-intel" ALSA_PCM_PLUGINS="adpcm alaw asym copy dmix dshare dsnoop empty extplug file hooks iec958 ioplug ladspa lfloat linear meter mmap_emul mulaw multi null plug rate route share shm softvol" APACHE2_MODULES="actions alias auth_basic auth_digest authn_anon authn_dbd authn_dbm authn_default authn_file authz_dbm authz_default authz_groupfile authz_host authz_owner authz_user autoindex cache dav dav_fs dav_lock dbd deflate dir disk_cache env expires ext_filter file_cache filter headers ident imagemap include info log_config logio mem_cache mime mime_magic negotiation proxy proxy_ajp proxy_balancer proxy_connect proxy_http rewrite setenvif so speling status unique_id userdir usertrack vhost_alias" APACHE2_MPMS="worker" CAMERAS="canon ptp2" ELIBC="glibc" INPUT_DEVICES="keyboard mouse evdev" KERNEL="linux" LCD_DEVICES="bayrad cfontz cfontz633 glk hd44780 lb216 lcdm001 mtxorb ncurses text" LINGUAS="en_GB en" LIRC_DEVICES="asusdh" USERLAND="GNU" VIDEO_CARDS="radeon vesa fbdev vga"
Comment 1 Gilles Dartiguelongue gentoo-dev 2008-08-17 09:32:22 UTC
looks like a gcc 4.3 issue.
Comment 2 Olivier Crete (RETIRED) gentoo-dev 2008-08-17 15:16:57 UTC
Can you try 0.1.23 that I just added to the tree? If it does not fix the problem. If not, I don't have gcc 4.3 here, so if someone who has it knows how to fix the problem, feel free to make a patch and send it upstream.
Comment 3 Rafał Mużyło 2008-08-17 17:45:54 UTC
I think a few lines are missing from the top, cause while the reason for
the errors is obvious, the warning should be fixed too.

As for the errors, '#include <cstring>' is missing,
as for the warning, hard to tell without seeing those lines.
Comment 4 Graham Murray 2008-08-17 18:00:31 UTC
(In reply to comment #2)
> Can you try 0.1.23 that I just added to the tree? 

0.1.23 built and installed with no problems. Thanks.

Comment 5 Olivier Crete (RETIRED) gentoo-dev 2008-08-17 18:13:15 UTC
good, lets mark this as fixed then