Gentoo Websites Logo
Go to: Gentoo Home Documentation Forums Lists Bugs Planet Store Wiki Get Gentoo!
Bug 219042 - net-fs/nfs-utils-1.1.2 fails to build
Summary: net-fs/nfs-utils-1.1.2 fails to build
Alias: None
Product: Gentoo Linux
Classification: Unclassified
Component: Current packages (show other bugs)
Hardware: AMD64 Linux
: High normal (vote)
Assignee: Network Filesystems
Depends on:
Reported: 2008-04-23 16:24 UTC by Petr Šabata
Modified: 2008-04-24 03:43 UTC (History)
0 users

See Also:
Package list:
Runtime testing required: ---

nfs-utils-1.1.2 build log (nfs-utils-1.1.2-build.log,17.22 KB, text/plain)
2008-04-23 16:56 UTC, Petr Šabata

Note You need to log in before you can comment on or make changes to this bug.
Description Petr Šabata 2008-04-23 16:24:16 UTC
net-fs/nfs-utils-1.1.2 fails to build:

config.status: executing depfiles commands
Making all in tools
make[1]: Entering directory `/var/tmp/portage/net-fs/nfs-utils-1.1.2/work/nfs-utils-1.1.2/tools'
Making all in locktest
make[2]: Entering directory `/var/tmp/portage/net-fs/nfs-utils-1.1.2/work/nfs-utils-1.1.2/tools/locktest'
DHAVE_CONFIG_H -I. -I../../support/include  -D_GNU_SOURCE -D_GNU_SOURCE -O2 -march=core2 -pipe -O2 -march=core2 -pipe -MT testlk-testlk.o -MD -MP -MF .deps/testlk-testlk.Tpo -c -o testlk-testlk.o `test -f 'testlk.c' || echo './'`testlk.c
/bin/sh: DHAVE_CONFIG_H: command not found
make[2]: [testlk-testlk.o] Error 127 (ignored)
mv -f .deps/testlk-testlk.Tpo .deps/testlk-testlk.Po
mv: cannot stat `.deps/testlk-testlk.Tpo': No such file or directory
make[2]: *** [testlk-testlk.o] Error 1
make[2]: Leaving directory `/var/tmp/portage/net-fs/nfs-utils-1.1.2/work/nfs-utils-1.1.2/tools/locktest'
make[1]: *** [all-recursive] Error 1
make[1]: Leaving directory `/var/tmp/portage/net-fs/nfs-utils-1.1.2/work/nfs-utils-1.1.2/tools'
make: *** [all-recursive] Error 1
 * ERROR: net-fs/nfs-utils-1.1.2 failed.

Reproducible: Always

Steps to Reproduce:
1. Switch to ~arch or unmask net-fs/nfs-utils-1.1.2
2. emerge =nfs-utils-1.1.2

ovecka contyk # emerge --info
Portage 2.1.5_rc6 (default-linux/amd64/2007.0/desktop, gcc-4.3.0, glibc-2.7-r2, 2.6.25-gentoo-r1 x86_64)
System uname: 2.6.25-gentoo-r1 x86_64 Intel(R) Core(TM)2 Duo CPU T7500 @ 2.20GHz
Timestamp of tree: Wed, 23 Apr 2008 15:32:01 +0000
ccache version 2.4 [enabled]
app-shells/bash:     3.2_p33
dev-java/java-config: 1.3.7, 2.1.5
dev-lang/python:     2.5.2-r2
dev-util/ccache:     2.4-r7
sys-apps/baselayout: 2.0.0
sys-apps/openrc:     0.2.2
sys-devel/autoconf:  2.13, 2.62
sys-devel/automake:  1.5, 1.7.9-r1, 1.8.5-r3, 1.9.6-r2, 1.10.1
sys-devel/binutils:  2.18-r1
sys-devel/gcc-config: 1.4.0-r4
sys-devel/libtool:   1.5.26
virtual/os-headers:  2.6.25-r1
ACCEPT_KEYWORDS="amd64 ~amd64"
CFLAGS="-O2 -march=core2 -pipe"
CONFIG_PROTECT_MASK="/etc/env.d /etc/env.d/java/ /etc/fonts/fonts.conf /etc/gconf /etc/gentoo-release /etc/php/apache2-php5/ext-active/ /etc/php/cgi-php5/ext-active/ /etc/php/cli-php5/ext-active/ /etc/revdep-rebuild /etc/terminfo /etc/texmf/web2c /etc/udev/rules.d"
CXXFLAGS="-O2 -march=core2 -pipe"
FEATURES="ccache distlocks parallel-fetch sandbox sfperms strict unmerge-orphans userfetch"
LINGUAS="en cs"
PORTAGE_RSYNC_OPTS="--recursive --links --safe-links --perms --times --compress --force --whole-file --delete --stats --timeout=180 --exclude=/distfiles --exclude=/local --exclude=/packages"
PORTDIR_OVERLAY="/usr/portage/local/layman/musicbrainz /usr/portage/local/layman/desktop-effects /usr/portage/local/layman/perl-experimental /usr/portage/local/layman/gcc-porting /usr/local/overlays/portage /usr/local/overlays/java-overlay /usr/local/overlays/java-experimental"
USE="X X509 a52 aac aalib acl acpi alsa amd64 amr amrnb amrwb apache2 audiofile bcmath berkdb bluetooth branding bzip2 cairo cdda cdr cgi cli cracklib crypt ctype cups curl dbus dell divx djvu dri dvd dvdr dvdread dvi eds emboss encode esd evo exif fam ffmpeg firefox flac ftp fuse gd gdbm gif glitz gmail gnome gnome-keyring gpm gstreamer gtk hal hash iconv ide imap ipw3945 isdnlog ithreads java javascript jingle jpeg keyring lame laptop libcaca libnotify lyrics mad mikmod mmkeys mmx modperl mouse mozdevelop mp3 mp4 mpeg mudflap musepack musicbrainz mysql nautilus ncurses nls nntp nptl nptlonly odbc ogg openal opengl openmp pam pcre pdf perl png pop posix postgres pppd python qt3support quicktime readline reflection samba sasl sdl session slang sms smtp sockets spl sqlite srt sse sse2 ssl ssse3 startup-notification subversion svg t1lib tcpd theora threads tiff truetype unicode usb vim vim-syntax visualisation vorbis wavpack wifi wmp x264 xcomposite xml xmlreader xmlrpc xmlwriter xorg xpm xv xvid zip zlib" ALSA_CARDS="ali5451 als4000 atiixp atiixp-modem bt87x ca0106 cmipci emu10k1x 	ens1370 ens1371 es1938 es1968 fm801 hda-intel intel8x0 intel8x0m maestro3 	trident usb-audio via82xx via82xx-modem ymfpci" ALSA_PCM_PLUGINS="adpcm alaw asym copy dmix dshare dsnoop empty extplug file hooks iec958 ioplug ladspa lfloat linear meter mulaw multi null plug rate route share shm softvol" APACHE2_MODULES="actions alias auth_basic authn_alias authn_anon authn_dbm authn_default authn_file authz_dbm authz_default authz_groupfile authz_host authz_owner authz_user autoindex cache dav dav_fs dav_lock deflate dir disk_cache env expires ext_filter file_cache filter headers include info log_config logio mem_cache mime mime_magic negotiation rewrite setenvif speling status unique_id userdir usertrack vhost_alias" ELIBC="glibc" INPUT_DEVICES="mouse keyboard synaptics" KERNEL="linux" LCD_DEVICES="bayrad cfontz cfontz633 glk hd44780 lb216 lcdm001 mtxorb ncurses text" LINGUAS="en cs" USERLAND="GNU" VIDEO_CARDS="i810"
Comment 1 Jeroen Roovers (RETIRED) gentoo-dev 2008-04-23 16:52:22 UTC
Please attach the entire build log - the first error appears to be in configure, not make (apparently CC is set to an empty string).
Comment 2 Petr Šabata 2008-04-23 16:56:08 UTC
Created attachment 150726 [details]
nfs-utils-1.1.2 build log
Comment 3 Jeroen Roovers (RETIRED) gentoo-dev 2008-04-23 17:13:57 UTC
(In reply to comment #2)
> Created an attachment (id=150726) [edit]
> nfs-utils-1.1.2 build log

Thanks! I don't see the cause of the problem. Maybe maintainers will.
Comment 4 SpanKY gentoo-dev 2008-04-24 03:36:05 UTC
you've set CC_FOR_BUILD to "" in your environment
Comment 5 Petr Šabata 2008-04-24 03:43:04 UTC
(In reply to comment #4)
> you've set CC_FOR_BUILD to "" in your environment

I'm not aware of that.