Gentoo Websites Logo
Go to: Gentoo Home Documentation Forums Lists Bugs Planet Store Wiki Get Gentoo!
Bugzilla DB migration completed. Please report issues to Infra team via email via infra@gentoo.org or IRC
Bug 213375 - www-client/kazehakase fails to compile with net-libs/xulrunner-1.9
Summary: www-client/kazehakase fails to compile with net-libs/xulrunner-1.9
Status: RESOLVED UPSTREAM
Alias: None
Product: Gentoo Linux
Classification: Unclassified
Component: Current packages (show other bugs)
Hardware: All Linux
: High normal (vote)
Assignee: MATSUU Takuto (RETIRED)
URL:
Whiteboard:
Keywords:
Depends on:
Blocks: xul-1.9
  Show dependency tree
 
Reported: 2008-03-14 11:34 UTC by Nirbheek Chauhan (RETIRED)
Modified: 2008-04-03 16:54 UTC (History)
1 user (show)

See Also:
Package list:
Runtime testing required: ---


Attachments
build log for www-client/kazehakase-0.5.3 (build.log,335.46 KB, text/plain)
2008-03-14 11:35 UTC, Nirbheek Chauhan (RETIRED)
Details

Note You need to log in before you can comment on or make changes to this bug.
Description Nirbheek Chauhan (RETIRED) gentoo-dev 2008-03-14 11:34:11 UTC
Compilation error for www-client/kazekahase-0.5.3 (probably same error for all versions, version numbers in portage are 'minor' in changes) :


 i686-pc-linux-gnu-g++ -DHAVE_CONFIG_H -I. -I../../../.. -fshort-wchar -I/usr/include/xulrunner-1.9/unstable -I/usr/include/nspr -I/usr/include/xulrunner-1.9/unstable -I/usr/include/xulrunner-1.9/unstable/accessibility -I/usr/include/xulrunner-1.9/unstable/appcomps -I/usr/include/xulrunner-1.9/unstable/browser -I/usr/include/xulrunner-1.9/unstable/chardet -I/usr/include/xulrunner-1.9/unstable/commandhandler -I/usr/include/xulrunner-1.9/unstable/content -I/usr/include/xulrunner-1.9/unstable/cookie -I/usr/include/xulrunner-1.9/unstable/docshell -I/usr/include/xulrunner-1.9/unstable/dom -I/usr/include/xulrunner-1.9/unstable/embedcomponents -I/usr/include/xulrunner-1.9/unstable/embed_base -I/usr/include/xulrunner-1.9/unstable/exthandler -I/usr/include/xulrunner-1.9/unstable/find -I/usr/include/xulrunner-1.9/unstable/gfx -I/usr/include/xulrunner-1.9/unstable/helperAppDlg -I/usr/include/xulrunner-1.9/unstable/intl -I/usr/include/xulrunner-1.9/unstable/imglib2 -I/usr/include/xulrunner-1.9/unstable/java -I/usr/include/xulrunner-1.9/unstable/jsconsole -I/usr/include/xulrunner-1.9/unstable/layout -I/usr/include/xulrunner-1.9/unstable/locale -I/usr/include/xulrunner-1.9/unstable/mimetype -I/usr/include/xulrunner-1.9/unstable/mozxfer -I/usr/include/xulrunner-1.9/unstable/necko -I/usr/include/xulrunner-1.9/unstable/necko2 -I/usr/include/xulrunner-1.9/unstable/nkcache -I/usr/include/xulrunner-1.9/unstable/oji -I/usr/include/xulrunner-1.9/unstable/pipnss -I/usr/include/xulrunner-1.9/unstable/pipboot -I/usr/include/xulrunner-1.9/unstable/pref -I/usr/include/xulrunner-1.9/unstable/profdirserviceprovider -I/usr/include/xulrunner-1.9/unstable/progressDlg -I/usr/include/xulrunner-1.9/unstable/passwordmgr -I/usr/include/xulrunner-1.9/unstable/sidebar -I/usr/include/xulrunner-1.9/unstable/shistory -I/usr/include/xulrunner-1.9/unstable/txtsvc -I/usr/include/xulrunner-1.9/unstable/uconv -I/usr/include/xulrunner-1.9/unstable/uriloader -I/usr/include/xulrunner-1.9/unstable/unicharutil -I/usr/include/xulrunner-1.9/unstable/wallet -I/usr/include/xulrunner-1.9/unstable/webbrowserpersist -I/usr/include/xulrunner-1.9/unstable/webbrwsr -I/usr/include/xulrunner-1.9/unstable/webshell -I/usr/include/xulrunner-1.9/unstable/widget -I/usr/include/xulrunner-1.9/unstable/windowwatcher -I/usr/include/xulrunner-1.9/unstable/xmlextras -pthread -I/usr/include/gtk-2.0 -I/usr/lib/gtk-2.0/include -I/usr/include/atk-1.0 -I/usr/include/cairo -I/usr/include/pango-1.0 -I/usr/include/glib-2.0 -I/usr/lib/glib-2.0/include -I/usr/include/freetype2 -I/usr/include/libpng12 -I/usr/include/pixman-1 -I../../../../src -I../../../../src -I../../../../src/bookmarks -I../../../../src/net -I../../../../src/libegg/pixbufthumbnail -I../../../../src/utils -I../../../../module/embed/gecko -DENABLE_GTKMOZEMBED=1 -fno-rtti -fshort-wchar -march=pentium-m -O2 -pipe -fomit-frame-pointer -MT libgtkmozembed_la-EmbedStream.lo -MD -MP -MF .deps/libgtkmozembed_la-EmbedStream.Tpo -c EmbedStream.cpp  -fPIC -DPIC -o .libs/libgtkmozembed_la-EmbedStream.o
In file included from EmbedEventListener.cpp:28:
EmbedPrivate.h:35:33: error: nsIDOMEventReceiver.h: No such file or directory
In file included from EmbedContentListener.cpp:27:
EmbedPrivate.h:35:33: error: nsIDOMEventReceiver.h: No such file or directory
In file included from EmbedProgress.h:27,
                 from EmbedProgress.cpp:22:
EmbedPrivate.h:35:33: error: nsIDOMEventReceiver.h: No such file or directory
In file included from EmbedStream.cpp:41:
EmbedPrivate.h:35:33: error: nsIDOMEventReceiver.h: No such file or directory
In file included from EmbedWindow.cpp:32:
EmbedPrivate.h:35:33: error: nsIDOMEventReceiver.h: No such file or directory
In file included from EmbedEventListener.cpp:28:
EmbedPrivate.h:136: error: ‘nsIDOMEventReceiver’ was not declared in this scope
EmbedPrivate.h:136: error: template argument 1 is invalid
In file included from EmbedContentListener.cpp:27:
EmbedPrivate.h:136: error: ‘nsIDOMEventReceiver’ was not declared in this scope
EmbedPrivate.h:136: error: template argument 1 is invalid
make[5]: *** [libgtkmozembed_la-EmbedEventListener.lo] Error 1
make[5]: *** Waiting for unfinished jobs....
make[5]: *** [libgtkmozembed_la-EmbedContentListener.lo] Error 1
In file included from EmbedProgress.h:27,
                 from EmbedProgress.cpp:22:
EmbedPrivate.h:136: error: ‘nsIDOMEventReceiver’ was not declared in this scope
EmbedPrivate.h:136: error: template argument 1 is invalid
In file included from EmbedWindow.cpp:32:
EmbedPrivate.h:136: error: ‘nsIDOMEventReceiver’ was not declared in this scope
EmbedPrivate.h:136: error: template argument 1 is invalid
make[5]: *** [libgtkmozembed_la-EmbedProgress.lo] Error 1
In file included from EmbedStream.cpp:41:
EmbedPrivate.h:136: error: ‘nsIDOMEventReceiver’ was not declared in this scope
EmbedPrivate.h:136: error: template argument 1 is invalid
In file included from EmbedWindow.cpp:33:
MozillaPrivate.h:50: error: ‘nsIDOMEventReceiver’ has not been declared
make[5]: *** [libgtkmozembed_la-EmbedWindow.lo] Error 1
make[5]: *** [libgtkmozembed_la-EmbedStream.lo] Error 1
make[5]: Leaving directory `/var/tmp/portage/www-client/kazehakase-0.5.3/work/kazehakase-0.5.3/module/embed/gecko/gtkmozembed'
make[4]: *** [all-recursive] Error 1
make[4]: Leaving directory `/var/tmp/portage/www-client/kazehakase-0.5.3/work/kazehakase-0.5.3/module/embed/gecko'
make[3]: *** [all-recursive] Error 1
make[3]: Leaving directory `/var/tmp/portage/www-client/kazehakase-0.5.3/work/kazehakase-0.5.3/module/embed'
make[2]: *** [all-recursive] Error 1
make[2]: Leaving directory `/var/tmp/portage/www-client/kazehakase-0.5.3/work/kazehakase-0.5.3/module'
make[1]: *** [all-recursive] Error 1
make[1]: Leaving directory `/var/tmp/portage/www-client/kazehakase-0.5.3/work/kazehakase-0.5.3'
make: *** [all] Error 2
 * 
 * ERROR: www-client/kazehakase-0.5.3 failed.
 * Call stack:
 *               ebuild.sh, line   49:  Called src_compile
 *             environment, line 2800:  Called die
 * The specific snippet of code:
 *       emake || die
 *  The die message:
 *   (no error message)
 * 
 * If you need support, post the topmost build error, and the call stack if relevant.
 * A complete build log is located at '/var/tmp/portage/www-client/kazehakase-0.5.3/temp/build.log'.
 * The ebuild environment file is located at '/var/tmp/portage/www-client/kazehakase-0.5.3/temp/environment'.
 *
Comment 1 Nirbheek Chauhan (RETIRED) gentoo-dev 2008-03-14 11:35:15 UTC
Created attachment 146110 [details]
build log for www-client/kazehakase-0.5.3

Build fail log
Comment 2 MATSUU Takuto (RETIRED) gentoo-dev 2008-04-03 16:54:05 UTC
kazehakase with xulrunner-1.9 is still work-in-progress by upstream.
http://lists.sourceforge.jp/mailman/archives/kazehakase-devel/2008-March/002827.html
(Japanese)