Gentoo Websites Logo
Go to: Gentoo Home Documentation Forums Lists Bugs Planet Store Wiki Get Gentoo!
Bug 130975 - net-nds/openldap-2.3 keywording
Summary: net-nds/openldap-2.3 keywording
Status: RESOLVED DUPLICATE of bug 134010
Alias: None
Product: Gentoo Linux
Classification: Unclassified
Component: New packages (show other bugs)
Hardware: All Linux
: High normal (vote)
Assignee: LDAP Herd
URL:
Whiteboard:
Keywords:
Depends on: 132521
Blocks:
  Show dependency tree
 
Reported: 2006-04-23 08:43 UTC by Markus Ullmann (RETIRED)
Modified: 2007-06-24 23:37 UTC (History)
2 users (show)

See Also:
Package list:
Runtime testing required: ---


Attachments

Note You need to log in before you can comment on or make changes to this bug.
Description Markus Ullmann (RETIRED) gentoo-dev 2006-04-23 08:43:28 UTC
Please test and ~keyword net-nds/openldap-2.3.21
Comment 1 Tobias Scherbaum (RETIRED) gentoo-dev 2006-04-23 11:00:14 UTC
Passed all tests, added to ~ppc.
Comment 2 Markus Rothe (RETIRED) gentoo-dev 2006-04-23 12:23:44 UTC
passed all test on ppc64 -> ~ppc64
Comment 3 Thomas Cort (RETIRED) gentoo-dev 2006-04-23 13:08:29 UTC
test003-search fails on alpha...

 *
 * Doing tests
 *
make[1]: Entering directory `/var/tmp/portage/openldap-2.3.21/work/openldap-2.3.21/tests'
Initiating LDAP tests for BDB...
Running ./scripts/all...
>>>>> Executing all LDAP tests for bdb
>>>>> Starting test000-rootdse ...
running defines.sh
Starting slapd on TCP/IP port 9011...
Using ldapsearch to retrieve the root DSE...
Waiting 5 seconds for slapd to start...
Using ldapsearch to retrieve the cn=Subschema...
Using ldapsearch to retrieve the cn=Monitor...
dn:
objectClass: top
objectClass: OpenLDAProotDSE
structuralObjectClass: OpenLDAProotDSE
configContext: cn=config
namingContexts: o=OpenLDAP Project,l=Internet
monitorContext: cn=Monitor
supportedControl: 1.3.6.1.4.1.4203.1.9.1.1
supportedControl: 2.16.840.1.113730.3.4.18
supportedControl: 2.16.840.1.113730.3.4.2
supportedControl: 1.3.6.1.4.1.4203.1.10.1
supportedControl: 1.2.840.113556.1.4.319
supportedControl: 1.2.826.0.1.334810.2.3
supportedControl: 1.2.826.0.1.3344810.2.3
supportedControl: 1.3.6.1.1.13.2
supportedControl: 1.3.6.1.1.13.1
supportedControl: 1.3.6.1.1.12
supportedExtension: 1.3.6.1.4.1.4203.1.11.1
supportedExtension: 1.3.6.1.4.1.4203.1.11.3
supportedFeatures: 1.3.6.1.1.14
supportedFeatures: 1.3.6.1.4.1.4203.1.5.1
supportedFeatures: 1.3.6.1.4.1.4203.1.5.2
supportedFeatures: 1.3.6.1.4.1.4203.1.5.3
supportedFeatures: 1.3.6.1.4.1.4203.1.5.4
supportedFeatures: 1.3.6.1.4.1.4203.1.5.5
supportedLDAPVersion: 3
vendorName: The OpenLDAP Project <http://www.openldap.org/>
entryDN:
subschemaSubentry: cn=Subschema

dn: cn=Subschema
objectClass: top
objectClass: subentry
objectClass: subschema
objectClass: extensibleObject
cn: Subschema

dn: cn=Monitor
objectClass: monitorServer
structuralObjectClass: monitorServer
cn: Monitor
description: This subtree contains monitoring/managing objects.
description: This object contains information about this server.
description: Most of the information is held in operational attributes, which
 must be explicitly requested.
creatorsName:
modifiersName:
createTimestamp: 20060423200635Z
modifyTimestamp: 20060423200635Z
monitoredInfo: OpenLDAP: slapd 2.3.21 (Apr 23 2006 15:58:47)
entryDN: cn=Monitor
subschemaSubentry: cn=Subschema
hasSubordinates: TRUE

>>>>> Test succeeded
>>>>> ./scripts/test000-rootdse completed OK.
>>>>> waiting 10 seconds for things to exit

>>>>> Starting test001-slapadd ...
running defines.sh
Running slapadd to build slapd database...
Starting slapd on TCP/IP port 9011...
Using ldapsearch to retrieve all the entries...
Filtering ldapsearch results...
Filtering original ldif used to create database...
Comparing filter output...
>>>>> Test succeeded
>>>>> ./scripts/test001-slapadd completed OK.
>>>>> waiting 10 seconds for things to exit

>>>>> Starting test002-populate ...
running defines.sh
Starting slapd on TCP/IP port 9011...
Using ldapsearch to check that slapd is running...
Using ldapadd to populate the database...
Using ldapsearch to read all the entries...
Filtering ldapsearch results...
Filtering original ldif used to create database...
Comparing filter output...
>>>>> Test succeeded
>>>>> ./scripts/test002-populate completed OK.
>>>>> waiting 10 seconds for things to exit

>>>>> Starting test003-search ...
running defines.sh
Running slapadd to build slapd database...
Running slapindex to index slapd database...
Starting slapd on TCP/IP port 9011...
Testing slapd searching...
Testing exact searching...
./scripts/test003-search: line 72: 13978 Segmentation fault      $SLAPD -f $CONF1 -h $URI1 -d $LVL $TIMING >$LOG1 2>&1
ldapsearch failed (255)!
./scripts/test003-search: line 76: kill: (13978) - No such process
>>>>> ./scripts/test003-search failed (exit 255)
make[1]: *** [bdb-yes] Error 255
make[1]: Leaving directory `/var/tmp/portage/openldap-2.3.21/work/openldap-2.3.21/tests'
make: *** [tests] Error 2


# emerge --info
Portage 2.1_pre9-r4 (default-linux/alpha/no-nptl/2.4, gcc-3.4.6, glibc-2.3.6-r3, 2.4.32 alpha)
=================================================================
System uname: 2.4.32 alpha EV56
Gentoo Base System version 1.12.0_pre16
dev-lang/python:     2.3.5, 2.4.2-r1
sys-apps/sandbox:    1.2.17
sys-devel/autoconf:  2.13, 2.59-r7
sys-devel/automake:  1.4_p6, 1.5, 1.6.3, 1.7.9-r1, 1.8.5-r3, 1.9.6-r2
sys-devel/binutils:  2.16.1-r2
sys-devel/libtool:   1.5.22
virtual/os-headers:  2.4.26-r1
ACCEPT_KEYWORDS="alpha ~alpha"
AUTOCLEAN="yes"
CBUILD="alpha-unknown-linux-gnu"
CFLAGS="-mieee -pipe -O2 -mcpu=ev56"
CHOST="alpha-unknown-linux-gnu"
CONFIG_PROTECT="/etc /usr/kde/2/share/config /usr/kde/3/share/config /usr/share/X11/xkb /usr/share/config /var/qmail/control"
CONFIG_PROTECT_MASK="/etc/eselect/compiler /etc/gconf /etc/revdep-rebuild /etc/terminfo /etc/texmf/web2c /etc/env.d"
CXXFLAGS="-mieee -pipe -O2 -mcpu=ev56"
DISTDIR="/usr/portage/distfiles"
FEATURES="autoconfig collision-protect distlocks metadata-transfer sandbox sfperms strict test"
GENTOO_MIRRORS="http://gentoo.mirrored.ca/"
MAKEOPTS="-j2"
PKGDIR="/usr/portage/packages"
PORTAGE_TMPDIR="/var/tmp"
PORTDIR="/usr/portage"
PORTDIR_OVERLAY="/usr/local/portage /usr/portage/local/layman/java-experimental"
SYNC="rsync://rsync.gentoo.org/gentoo-portage"
USE="alpha X aac aalib aim alsa apache2 artworkextra async audacious audiofile bash-completion berkdb binfilter bitmap-fonts bittorrent bl bonjour c++ cairo calendar cdinstall cdparanoia cdr cdrom chroot cli config_wizard cracklib crypt cscope csv ctype cups curl curlwrappers cvs cvsgraph dhcp dillo dri editor eds elf encode epiphany escreen esd ethereal extraicons extras ffmpeg fftw figlet firefox flac ftp gdb gdbm gif glep gnome gnutls gpm grammar gsl gstreamer gtalk gtk gtk2 gtkspell gvim gzip html icq id3 imlib ipv6 jabber javascript jpeg justify ladspa lame libg++ libsexy libwww lite lj logrotate lua mad mapeditor md5sum mikmod motif moznoirc moznomail moznoroaming mozsha1 mp3 mpeg mpeg2 mplayer msn msnextras music ncurses net nethack nls offensive ogg oggvorbis opengl openssh openssl oscar oss pam pcre pdflib perl png python quicktime quotes readline recode reflection reiserfs scp screen sdl session sftp skins sndfile sockets sounds sox speech spell spl ssl subversion symlink syslog tcpd threads truetype truetype-fonts type1-fonts userlocales vcd videos vim vim-with-x vorbis wma wma123 xml xml2 xmlreader xmms xorg xv xvid yahoo zip zlib elibc_glibc kernel_linux userland_GNU"
Unset:  ASFLAGS, CTARGET, EMERGE_DEFAULT_OPTS, INSTALL_MASK, LANG, LC_ALL, LDFLAGS, LINGUAS
Comment 4 Thomas Cort (RETIRED) gentoo-dev 2006-04-23 19:07:25 UTC
test003-search from net-nds/openldap-2.2.28-r4 also fails on alpha...

>>>>> Starting test003-search ...
running defines.sh
Running slapadd to build slapd database...
Running slapindex to index slapd database...
Starting slapd on TCP/IP port 9011...
Testing slapd searching...
Waiting 5 seconds for slapd to start...
Testing exact searching...
./scripts/test003-search: line 70:  3858 Segmentation fault      $SLAPD -f $CONF1 -h $URI1 -d $LVL $TIMING >$LOG1 2>&1
ldapsearch failed (255)!
./scripts/test003-search: line 74: kill: (3858) - No such process
>>>>> ./scripts/test003-search failed (exit 255)
make[1]: *** [bdb-yes] Error 255
make[1]: Leaving directory `/var/tmp/portage/openldap-2.2.28-r4/work/openldap-2.2.28/tests'
make: *** [tests] Error 2
Comment 5 Patrick McLean gentoo-dev 2006-04-24 07:15:16 UTC
all tests passed on amd64, added ~amd64
Comment 6 Thomas Cort (RETIRED) gentoo-dev 2006-04-26 10:12:47 UTC
(In reply to comment #3)
jokey thought it might be db, but I re-emerge'd sys-libs/db-4.2.52_p4 with FEATURES="test" and none of the tests failed. The tests seemed pretty comprehensive as they took 18+ hrs on my 500MHz alpha. Any suggestions on what to try next?
Comment 7 Jason Wever (RETIRED) gentoo-dev 2006-04-28 14:23:34 UTC
Hallowed are the ~sparc keywordori
Comment 8 Thomas Cort (RETIRED) gentoo-dev 2006-05-04 06:31:23 UTC
(In reply to comment #6)
> (In reply to comment #3)
> jokey thought it might be db, but I re-emerge'd sys-libs/db-4.2.52_p4 with
> FEATURES="test" and none of the tests failed.
Actually the tests did fail, but there is a bug in db.eclass which caused the emerge to not 'die' and I wrongfully assumed that since db got installed that all tests had passed. I'm going to file bugs for db.eclass and the db test failures. After those are dealt with we'll try testing openldap again on alpha.
Comment 9 Thomas Cort (RETIRED) gentoo-dev 2006-06-01 13:51:21 UTC
all tests passed with openldap-2.3.24, marked it stable on alpha for security Bug $134010.
Comment 10 Markus Ullmann (RETIRED) gentoo-dev 2006-06-01 14:06:20 UTC
We're keywording there already. Don't need a second bug for it.

*** This bug has been marked as a duplicate of 134010 ***
Comment 11 Joshua Kinard gentoo-dev 2006-09-04 22:12:04 UTC
2.3.24 stable on mips.