Summary: | app-emacs/julia-mode-0.4_p20211023 fails tests: FAILED julia--test-end-of-defun-nested-2 | ||
---|---|---|---|
Product: | Gentoo Linux | Reporter: | Agostino Sarubbo <ago> |
Component: | Current packages | Assignee: | GNU Emacs project <gnu-emacs> |
Status: | RESOLVED FIXED | ||
Severity: | normal | Keywords: | TESTFAILURE |
Priority: | Normal | ||
Version: | unspecified | ||
Hardware: | All | ||
OS: | Linux | ||
Whiteboard: | |||
Package list: | Runtime testing required: | --- | |
Attachments: | build.log |
Description
Agostino Sarubbo
![]() Created attachment 889799 [details]
build.log
build log and emerge --info
Error(s) that match a know pattern in addition to what has been reported in the summary: FAILED 17/61 julia--test-end-of-defun-nested-2 (0.000936 sec) at julia-mode-tests.el:868 FAILED julia--test-end-of-defun-nested-2 The bug has been closed via the following commit(s): https://gitweb.gentoo.org/repo/gentoo.git/commit/?id=704bb817d5c2ed86651d0c238bbf2005f4924dc1 commit 704bb817d5c2ed86651d0c238bbf2005f4924dc1 Author: Maciej Barć <xgqt@gentoo.org> AuthorDate: 2024-07-23 23:02:04 +0000 Commit: Maciej Barć <xgqt@gentoo.org> CommitDate: 2024-07-23 23:12:15 +0000 app-emacs/julia-mode: deselect failed test Closes: https://bugs.gentoo.org/928919 Signed-off-by: Maciej Barć <xgqt@gentoo.org> .../julia-mode/julia-mode-0.4_p20211023.ebuild | 28 +++++++++++++++------- 1 file changed, 20 insertions(+), 8 deletions(-) |