Gentoo Websites Logo
Go to: Gentoo Home Documentation Forums Lists Bugs Planet Store Wiki Get Gentoo!

Bug 872134

Summary: app-text/paperwork-backend-2.1.1-r1 fails tests
Product: Gentoo Linux Reporter: Agostino Sarubbo <ago>
Component: Current packagesAssignee: Bernard Cafarelli <voyageur>
Status: CONFIRMED ---    
Severity: normal CC: mgorny
Priority: Normal    
Version: unspecified   
Hardware: All   
OS: Linux   
Package list:
Runtime testing required: ---
Attachments: build.log

Description Agostino Sarubbo gentoo-dev 2022-09-21 07:07:54 UTC

Issue: app-text/paperwork-backend-2.1.1-r1 fails tests.
Discovered on: amd64 (internal ref: ci)
Comment 1 Agostino Sarubbo gentoo-dev 2022-09-21 07:07:56 UTC
Created attachment 813193 [details]

build log and emerge --info
Comment 2 Agostino Sarubbo gentoo-dev 2022-09-21 07:07:57 UTC
Error(s) that match a know pattern:

AssertionError: 0 != 1
AssertionError: False is not true
AssertionError: None is not true
FAILED (failures=5, errors=24, skipped=2)
FAIL: test_convert_pdf (tests.converter.tests_libreoffice.TestLibreOfficePdf)
FAIL: test_import_docx (tests.docimport.tests_converted.TestConvertedImport)
FAIL: test_import_duplicated_docx (tests.docimport.tests_converted.TestConvertedImport)
FAIL: test_on_page_get_img_url (tests.model.tests_converted.TestConvertedPdf)
FAIL: test_sync (tests.model.tests_converted.TestConvertedPdf)
ModuleNotFoundError: No module named 'pyocr'
ValueError: empty vocabulary passed to fit