Gentoo Websites Logo
Go to: Gentoo Home Documentation Forums Lists Bugs Planet Store Wiki Get Gentoo!

Bug 866049

Summary: dev-python/sphinxcontrib-spelling-7.6.0 fails tests (MUSL)
Product: Gentoo Linux Reporter: Agostino Sarubbo <ago>
Component: Current packagesAssignee: Python Gentoo Team <python>
Status: CONFIRMED ---    
Severity: normal    
Priority: Normal    
Version: unspecified   
Hardware: All   
OS: Linux   
Package list:
Runtime testing required: ---
Attachments: build.log

Description Agostino Sarubbo gentoo-dev 2022-08-22 15:51:19 UTC

Issue: dev-python/sphinxcontrib-spelling-7.6.0 fails tests (MUSL).
Discovered on: amd64 (internal ref: tinderbox_musl)

This machine uses MUSL libc
Comment 1 Agostino Sarubbo gentoo-dev 2022-08-22 15:51:21 UTC
Created attachment 800481 [details]

build log and emerge --info
Comment 2 Agostino Sarubbo gentoo-dev 2022-08-22 15:51:22 UTC
Error(s) that match a know pattern:

E       AssertionError: assert ' of the_source.public_function:None: (vaule)' in ' of the_source.public_function:1: (vaule)  Pass a vaule
FAILED tests/ - AssertionError: assert 'the_s...
WARNING Failed to scan contributors: Command '['git', 'log', '--quiet', '--no-color', '--pretty=format:%(trailers:key=Co-Authored-By,separator=%x0A)%x0A%an%x0A%cn']' returned non-zero exit status 128.
fatal: not a git repository (or any parent up to mount point /var/tmp)